1.000000000000000000e+00 7.477375029004357243e-01 4.285827426485905312e-01 5.511546189666038931e-01 8.582295676213305136e-01 5.532978341099408226e-01 5.575968229987260383e-01 5.831242120543274066e-01 4.991789876182213814e-01 2.580184319077182820e-01 6.178525854167337128e-01 6.901010137705835268e-01 6.333671702826798589e-01 7.003501929822308902e-01 7.417312953232114703e-01 5.379570830843933837e-01 5.728850463820577277e-01
7.477375029004357243e-01 1.000000000000000000e+00 5.732651180333120378e-01 7.766174072346675450e-01 6.890223405142432700e-01 5.962582955524963202e-01 7.500699169872176997e-01 7.351412055780849331e-01 4.790516074771319355e-01 3.483018897925935220e-01 6.759628792283388643e-01 7.124034419838055632e-01 6.787405581652421471e-01 7.793687736398509092e-01 8.124399083932832832e-01 7.669414974286603570e-01 6.632026810142692685e-01
4.285827426485905312e-01 5.732651180333120378e-01 1.000000000000000000e+00 6.512442865781101764e-01 5.859758093882777574e-01 9.127126057431637074e-01 7.517932401484788141e-01 6.972132871997962500e-01 9.759561649145750972e-02 1.226137414150771654e-01 6.953210791251124290e-01 7.124360164068528345e-01 6.902180823137959997e-01 4.173534730408995364e-01 4.183445065838733989e-01 6.165346383084783222e-01 5.250683505101630955e-01
5.511546189666038931e-01 7.766174072346675450e-01 6.512442865781101764e-01 1.000000000000000000e+00 5.362800090520012386e-01 5.874183623596106463e-01 9.273563821195165424e-01 8.337051426668844467e-01 4.699551619578500317e-01 4.119738316329735750e-01 5.773898104119890018e-01 6.656710259870679547e-01 6.625269599731068437e-01 8.114981236347530436e-01 7.492924086546358664e-01 8.338002456581471433e-01 7.225070009328149467e-01
8.582295676213305136e-01 6.890223405142432700e-01 5.859758093882777574e-01 5.362800090520012386e-01 1.000000000000000000e+00 7.419142373303007076e-01 5.758388449046148994e-01 5.776758437274743807e-01 2.644753355897406233e-01 1.333249249713676921e-01 8.028257600316266451e-01 8.072079365201693113e-01 6.903357876880303889e-01 6.258986805336609338e-01 6.545906430264890608e-01 5.770541499857037016e-01 4.904548186684735134e-01
5.532978341099408226e-01 5.962582955524963202e-01 9.127126057431637074e-01 5.874183623596106463e-01 7.419142373303007076e-01 1.000000000000000000e+00 6.946636304623735603e-01 6.665911749416173482e-01 6.313117785444188890e-02 9.976922596678378108e-02 7.756479420990198825e-01 8.118778516639092446e-01 7.328117455520423151e-01 4.326432853689192171e-01 4.449079385961863808e-01 5.909745042525706982e-01 4.927924796332766033e-01
5.575968229987260383e-01 7.500699169872176997e-01 7.517932401484788141e-01 9.273563821195165424e-01 5.758388449046148994e-01 6.946636304623735603e-01 1.000000000000000000e+00 9.000184774367204765e-01 4.511093321456168259e-01 4.134212733704680787e-01 6.184571945764414380e-01 7.296168670813266699e-01 7.221349828576321128e-01 7.744369806454697303e-01 7.166036180706948366e-01 8.239782407155092914e-01 7.539149810498251281e-01
5.831242120543274066e-01 7.351412055780849331e-01 6.972132871997962500e-01 8.337051426668844467e-01 5.776758437274743807e-01 6.665911749416173482e-01 9.000184774367204765e-01 1.000000000000000000e+00 4.766132231298803590e-01 4.997610621131209907e-01 6.123440458374753703e-01 7.803553710711187419e-01 8.427931639758415860e-01 7.165017801865622982e-01 6.676952375142555240e-01 8.607077113335306340e-01 7.952221549476482521e-01
4.991789876182213814e-01 4.790516074771319355e-01 9.759561649145750972e-02 4.699551619578500317e-01 2.644753355897406233e-01 6.313117785444188890e-02 4.511093321456168259e-01 4.766132231298803590e-01 1.000000000000000000e+00 6.763635593476695629e-01 3.048319691830339920e-02 2.700661296261885891e-01 4.114211848168656260e-01 6.065645848961833675e-01 6.385497794270216243e-01 4.395177133354534749e-01 7.007714081559454078e-01
2.580184319077182820e-01 3.483018897925935220e-01 1.226137414150771654e-01 4.119738316329735750e-01 1.333249249713676921e-01 9.976922596678378108e-02 4.134212733704680787e-01 4.997610621131209907e-01 6.763635593476695629e-01 1.000000000000000000e+00 -4.871693137311638305e-02 2.777821517883061753e-01 5.064864616552013921e-01 4.384914567415674758e-01 4.850549587014667541e-01 4.768092455755265635e-01 7.061413773863342014e-01
6.178525854167337128e-01 6.759628792283388643e-01 6.953210791251124290e-01 5.773898104119890018e-01 8.028257600316266451e-01 7.756479420990198825e-01 6.184571945764414380e-01 6.123440458374753703e-01 3.048319691830339920e-02 -4.871693137311638305e-02 1.000000000000000000e+00 7.794758959067481507e-01 6.570537002282478278e-01 4.712912136581681177e-01 5.463629135973386841e-01 6.183302176516835003e-01 3.382586365424767316e-01
6.901010137705835268e-01 7.124034419838055632e-01 7.124360164068528345e-01 6.656710259870679547e-01 8.072079365201693113e-01 8.118778516639092446e-01 7.296168670813266699e-01 7.803553710711187419e-01 2.700661296261885891e-01 2.777821517883061753e-01 7.794758959067481507e-01 1.000000000000000000e+00 8.804817364257369050e-01 5.996926371350578266e-01 6.331406789096394316e-01 7.508817194054265842e-01 6.378354313869517567e-01
6.333671702826798589e-01 6.787405581652421471e-01 6.902180823137959997e-01 6.625269599731068437e-01 6.903357876880303889e-01 7.328117455520423151e-01 7.221349828576321128e-01 8.427931639758415860e-01 4.114211848168656260e-01 5.064864616552013921e-01 6.570537002282478278e-01 8.804817364257369050e-01 1.000000000000000000e+00 6.064917260752341610e-01 6.021781638243012269e-01 8.010996931420090172e-01 7.778141468695050076e-01
7.003501929822308902e-01 7.793687736398509092e-01 4.173534730408995364e-01 8.114981236347530436e-01 6.258986805336609338e-01 4.326432853689192171e-01 7.744369806454697303e-01 7.165017801865622982e-01 6.065645848961833675e-01 4.384914567415674758e-01 4.712912136581681177e-01 5.996926371350578266e-01 6.064917260752341610e-01 1.000000000000000000e+00 8.129939460684784125e-01 7.761677201593736308e-01 7.867107076278543332e-01
7.417312953232114703e-01 8.124399083932832832e-01 4.183445065838733989e-01 7.492924086546358664e-01 6.545906430264890608e-01 4.449079385961863808e-01 7.166036180706948366e-01 6.676952375142555240e-01 6.385497794270216243e-01 4.850549587014667541e-01 5.463629135973386841e-01 6.331406789096394316e-01 6.021781638243012269e-01 8.129939460684784125e-01 1.000000000000000000e+00 7.345107474549554816e-01 7.181214615573615623e-01
5.379570830843933837e-01 7.669414974286603570e-01 6.165346383084783222e-01 8.338002456581471433e-01 5.770541499857037016e-01 5.909745042525706982e-01 8.239782407155092914e-01 8.607077113335306340e-01 4.395177133354534749e-01 4.768092455755265635e-01 6.183302176516835003e-01 7.508817194054265842e-01 8.010996931420090172e-01 7.761677201593736308e-01 7.345107474549554816e-01 1.000000000000000000e+00 8.239714153443220557e-01
5.728850463820577277e-01 6.632026810142692685e-01 5.250683505101630955e-01 7.225070009328149467e-01 4.904548186684735134e-01 4.927924796332766033e-01 7.539149810498251281e-01 7.952221549476482521e-01 7.007714081559454078e-01 7.061413773863342014e-01 3.382586365424767316e-01 6.378354313869517567e-01 7.778141468695050076e-01 7.867107076278543332e-01 7.181214615573615623e-01 8.239714153443220557e-01 1.000000000000000000e+00
