{
  "$id": "https://momayo.gitlab.io/schemas/Identifier.schema.json",
  "$schema": "http://json-schema.org/draft-07/schema#",
  "title": "Identifier",
  "type": "object",
  "properties": {
    "id": {
      "type": "string",
      "description": "URI of the resource"
    },
    "type": {
      "type": "string", 
      "enum": ["Identifier"]
    },
    "label": {
      "type": "string",
      "minimum": 1
    },
    "classified_as": {
      "$ref": "https://momayo.gitlab.io/schemas/Type.schema.json"
    }
  }
}