{
  "$id": "https://momayo.gitlab.io/schemas/Place.schema.json",
  "$schema": "http://json-schema.org/draft-07/schema#",
  "title": "Place",
  "type": "object",
  "properties": {
    "id": {
      "type": "string",
      "description": "URI of the resource"
    },
    "type": {
      "type": "string", 
      "enum": ["Place"]
    },
    "label": {
      "description": "Label to describe the place.",
      "type": "string",
      "minimum": 1
    },
    "note": {
      "description": "Text to describe the place.",
      "type": "string"
    }
  }
}