{
  "$id": "https://momayo.gitlab.io/schemas/Timespan.schema.json",
  "$schema": "http://json-schema.org/draft-07/schema#",
  "title": "TimeSpan",
  "type": "object",
  "properties": {
    "id": {
      "type": "string",
      "description": "URI of the resource"
    },
    "type": {
      "type": "string", 
      "enum": ["TimeSpan"]
    },
    "label": {
      "description": "Label to describe the timespan.",
      "type": "string",
      "minimum": 1
    },
    "begin_of_the_begin": {
      "type": "string",
      "format": "date"
    },
    "end_of_the_begin": {
      "type": "string",
      "format": "date"
    },
    "begin_of_the_end": {
      "type": "string",
      "format": "date"
    },
    "end_of_the_end": {
      "type": "string",
      "format": "date"
    }
  }
}