{
  "$id": "https://momayo.gitlab.io/schemas/Destruction.schema.json",
  "$schema": "http://json-schema.org/draft-07/schema#",
  "title": "Destruction",
  "type": "object",
  "properties": {
    "id": {
      "type": "string",
      "description": "URI of the resource"
    },
    "type": {
      "type": "string", 
      "enum": ["Destruction"]
    },
    "label": {
      "description": "Label to describe the destruction event.",
      "type": "string",
      "minimum": 1
    },
    "note": {
      "description": "Text to describe the destruction event.",
      "type": "string"
    },
    "destroyed": {
      "$ref": "https://momayo.gitlab.io/schemas/Manmadeobject.schema.json"
    },
    "took_place_at": {
      "$ref": "https://momayo.gitlab.io/schemas/Place.schema.json"
    },
    "timespan": {
      "$ref": "https://momayo.gitlab.io/schemas/Timespan.schema.json"
    },
    "carried_out_by": {
      "$ref": "https://momayo.gitlab.io/schemas/Actor.schema.json"
    },
    "part": {
      "$ref": "https://momayo.gitlab.io/schemas/Destruction.schema.json"
    }
  }
}