{
    "id": "perspective4",
    "sparqlQueriesFile": "SparqlQueriesPerspective4.js",
    "sparqlQueries": "federatedSearchSparqlQueries",
    "frontPageImage": "main_page/places-452x262.jpg",
    "searchMode": "federated-search",
    "defaultActiveFacets": [
        "datasetSelector"
    ],
    "feredatedResultsConfig": {
        "sortBy": "broaderAreaLabel",
        "sortDirection": "asc",
        "groupBy": "broaderTypeLabel",
        "groupByLabel": "Paikanlaji"
    },
    "resultClasses": {
        "table": {
            "tabID": 0,
            "tabPath": "table",
            "tabIcon": "CalendarViewDay"
        },
        "mapClusters": {
            "tabID": 1,
            "tabPath": "map_clusters",
            "tabIcon": "TripOrigin"
        },
        "mapMarkers": {
            "tabID": 2,
            "tabPath": "map_markers",
            "tabIcon": "LocationOn"
        },
        "statistics": {
            "tabID": 3,
            "tabPath": "statistics",
            "tabIcon": "PieChart"
        },
        "download": {
            "tabID": 4,
            "tabPath": "download",
            "tabIcon": "CloudDownload"
        },
        "boundingboxSearch": {}
    },
    "datasets": {
        "norse": {
            "endpoint": "https://sd-33591800.stardog.cloud:5820/nos-hs/query",
            "selected": true,
            "useAuth": true
        },
        "saga": {
            "endpoint": "https://sd-33591800.stardog.cloud:5820/nos-hs/query",
            "selected": true,
            "useAuth": true
        },
        "nsdb": {
            "endpoint": "https://sd-33591800.stardog.cloud:5820/nos-hs/query",
            "selected": true,
            "useAuth": true
        },
        "tgn": {
            "endpoint": "https://vocab.getty.edu/sparql.json",
            "selected": false
        }

    },
    "maps": {
        "boundingboxSearch": {
            "center": [
                65.184809,
                27.31405
            ],
            "zoom": 5
        },
        "mapClusters": {
            "center": [
                65.184809,
                27.31405
            ],
            "zoom": 5
        },
        "mapMarkers": {
            "center": [
                65.184809,
                27.31405
            ],
            "zoom": 5
        }
    },
    "facets": {
        "datasetSelector": {
            "filterType": "datasetSelector",
            "containerClass": "six"
        },
        "prefLabel": {
            "filterType": "clientFSLiteral",
            "searchField": true,
            "containerClass": "ten",
            "facetType": "list"
        },
        "broaderTypeLabel": {
            "filterType": "clientFSLiteral",
            "searchField": true,
            "containerClass": "ten",
            "facetType": "list"
        },
        "broaderAreaLabel": {
            "filterType": "clientFSLiteral",
            "searchField": true,
            "containerClass": "ten",
            "facetType": "list"
        },
        "documentLabel": {
            "filterType": "clientFSLiteral",
            "searchField": true,
            "containerClass": "ten",
            "facetType": "list"
        },
        "referenceLabel": {
            "filterType": "clientFSLiteral",
            "searchField": true,
            "containerClass": "ten",
            "facetType": "list"
        },
        "collectionYear": {
            "filterType": "clientFSLiteral",
            "searchField": true,
            "containerClass": "ten",
            "facetType": "list"
        },
        "source": {
            "filterType": "clientFSLiteral",
            "searchField": false,
            "containerClass": "three",
            "facetType": "list"
        }
    }
}