{
  "id": "namedPlaces",
  "endpoint": {
    "url": "https://test.sparql.spraksamlingane.ubbe.no/",
    "useAuth": false,
    "prefixesFile": "SparqlQueriesPrefixes.js"
  },
  "sparqlQueriesFile": "SparqlQueriesNamedPlaces.js",
  "baseURI": "http://data.spraksamlingane.no/stadnamn",
  "URITemplate": "<BASE_URI>/archive/id/<LOCAL_ID>",
  "resultClasses": {
    "namedPlaces": {
      "instanceConfig": {
        "propertiesQueryBlock": "namedPlaceProperties",
        "instancePageResultClasses": {
          "instancePageTable": {
            "tabID": 0,
            "component": "InstancePageTable",
            "tabPath": "table",
            "tabIcon": "CalendarViewDay"
          },
          "instancePageExport": {
            "tabID": 1,
            "component": "Export",
            "tabPath": "export",
            "tabIcon": "CloudDownload",
            "pageType": "instancePage"
          }
        }
      }
    }
  },
  "properties": [
    {
      "id": "prefLabel",
      "valueType": "object",
      "makeLink": true,
      "externalLink": false,
      "sortValues": true,
      "numberedList": false,
      "minWidth": 250
    },
    {
      "id": "uri",
      "valueType": "object",
      "makeLink": true,
      "externalLink": true,
      "sortValues": true,
      "numberedList": false,
      "onlyOnInstancePage": true
    },
    {
      "id": "county",
      "valueType": "object",
      "makeLink": true,
      "externalLink": false,
      "sortValues": false,
      "numberedList": false,
      "onlyOnInstancePage": true,
      "disableSort": true
    }
  ]
}