{
  "id": "assignments",
  "endpoint": {
    "url": "http://158.39.201.237/",
    "useAuth": false,
    "prefixesFile": "SparqlQueriesPrefixes.js"
  },
  "sparqlQueriesFile": "SparqlQueriesAssignments.js",
  "baseURI": "http://data.toponymi.spraksamlingane.no",
  "URITemplate": "<BASE_URI>/id/<LOCAL_ID>",
  "resultClasses": {
    "assignments": {
      "instanceConfig": {
        "propertiesQueryBlock": "assignmentProperties",
        "instancePageResultClasses": {
          "instancePageTable": {
            "tabID": 0,
            "component": "InstancePageTable",
            "tabPath": "table",
            "tabIcon": "CalendarViewDay"
          },
          "instancePageExport": {
            "tabID": 1,
            "component": "Export",
            "tabPath": "export",
            "tabIcon": "CloudDownload",
            "pageType": "instancePage"
          }
        }
      }
    }
  },
  "properties": [
    {
      "id": "uri",
      "valueType": "object",
      "makeLink": true,
      "externalLink": true,
      "sortValues": true,
      "numberedList": false,
      "onlyOnInstancePage": true
    },
    {
      "id": "prefLabel",
      "valueType": "object",
      "makeLink": true,
      "externalLink": false,
      "sortValues": true,
      "numberedList": false,
      "minWidth": 170
    }
  ]
}