ID	wikidata	merknader	Kommuneenhet	Kommune	"﻿Fylke"	KNR	Opprettet	Opphør
457	18395241		1225 Varaldsøy	Varaldsøy	"Hordaland"	1225	1902	1965
701	Q1006463		1661 Tiller	Tiller	"Sør-Trøndelag"	1661	1899	1964
117	Q101341		0501 Lillehammer	Lillehammer	"Oppland"	0501	1838	2020
1001	Q101341		3405 Lillehammer	Lillehammer	"Innlandet"	3405	2020	9999
361	Q1016284		1041 Lista	Lista	"Vest-Agder"	1041	1838	1965
560	Q104095		1502 Molde	Molde	"Møre og Romsdal"	1502	1838	2020
564	Q104095		1506 Molde	Molde	"Møre og Romsdal"	1506	2020	9999
888	Q104379		2003 Vadsø	Vadsø	"Finnmark"	2003	1838	2020
1140	Q104379		5405 Vadsø	Vadsø	"Troms og Finnmark"	5405	2020	9999
76	Q104400		0401 Hamar	Hamar	"Hedmark"	0401	1848	1992
79	Q104400		0403 Hamar	Hamar	"Hedmark"	0403	1992	2020
1000	Q104400		3403 Hamar	Hamar	"Innlandet"	3403	2020	9999
860	Q106830848		1920 Lavangen	Lavangen	"Troms"	1920	1907	1964
3	Q107135		0103 Fredrikstad	Fredrikstad	"Østfold"	0103	1838	1994
6	Q107135		0106 Fredrikstad	Fredrikstad	"Østfold"	0106	1994	2020
951	Q107135		3004 Fredrikstad	Fredrikstad	"Viken"	3004	2020	9999
886	Q107351		2001 Hammerfest	Hammerfest	"Finnmark"	2001	1838	1992
889	Q107351		2004 Hammerfest	Hammerfest	"Finnmark"	2004	1992	2020
1141	Q107351		5406 Hammerfest	Hammerfest	"Troms og Finnmark"	5406	2020	9999
204	Q107392		0704 Tønsberg	Tønsberg	"Vestfold"	0704	1988	2020
205	Q107392		0705 Tønsberg	Tønsberg	"Vestfold"	0705	1838	1988
1047	Q107392		3803 Tønsberg	Tønsberg	"Vestfold og Telemark"	3803	2020	9999
526	Q107396		1419 Leikanger	Leikanger	"Sogn og Fjordane"	1419	1838	2020
108	Q107553907		0435 Os	Os	"Hedmark"	0435	1926	1966
110	Q107553916		0436 Tolga	Tolga	"Hedmark"	0436	1838	1966
127	Q107555832		0518 Fron	Fron	"Oppland"	0518	1838	1851
128	Q107555842		0518 Nord-Fron	Nord-Fron	"Oppland"	0518	1851	1966
130	Q107555859		0519 Sør-Fron	Sør-Fron	"Oppland"	0519	1851	1966
202	Q107557586		0703 Horten	Horten	"Vestfold"	0703	1858	1988
354	Q107567592		1036 Fjotland	Fjotland	"Vest-Agder"	1036	1838	1841
582	Q107612100		1526 Stordal	Stordal	"Møre og Romsdal"	1526	1892	1965
586	Q107612148		1529 Skodje	Skodje	"Møre og Romsdal"	1529	1849	1965
606	Q107613038		1545 Aukra	Aukra	"Møre og Romsdal"	1545	1838	1924
654	Q107618657		1619 Frøien	Frøien	"Sør-Trøndelag"	1619	1877	1906
740	Q107622429		1737 Lierne	Lierne	"Nord-Trøndelag"	1737	1874	1915
797	Q107630106		1833 Mo	Mo	"Nordland"	1833	1838	1923
770	Q107631250		1806 Svolvær	Svolvær	"Nordland"	1806	1918	1964
907	Q107635889		2027 Næsseby	Næsseby	"Finnmark"	2027	1839	1858
2	Q108025		0102 Sarpsborg	Sarpsborg	"Østfold"	0102	1839	1992
5	Q108025		0105 Sarpsborg	Sarpsborg	"Østfold"	0105	1992	2020
950	Q108025		3003 Sarpsborg	Sarpsborg	"Viken"	3003	2020	9999
118	Q108031		0502 Gjøvik	Gjøvik	"Oppland"	0502	1861	2020
1002	Q108031		3407 Gjøvik	Gjøvik	"Innlandet"	3407	2020	9999
316	Q108966		1002 Mandal	Mandal	"Vest-Agder"	1002	1838	2020
887	Q108983		2002 Vardø	Vardø	"Finnmark"	2002	1838	2020
1139	Q108983		5404 Vardø	Vardø	"Troms og Finnmark"	5404	2020	9999
167	Q108988		0604 Kongsberg	Kongsberg	"Buskerud"	0604	1838	2020
953	Q108988		3006 Kongsberg	Kongsberg	"Viken"	3006	2020	9999
678	Q108999		1640 Røros	Røros	"Sør-Trøndelag"	1640	1838	2018
1194	Q108999		5025 Røros	Røros	"Trøndelag"	5025	2018	9999
206	Q109005		0706 Sandefjord	Sandefjord	"Vestfold"	0706	1838	2017
210	Q109005		0710 Sandefjord	Sandefjord	"Vestfold"	0710	2017	2020
1048	Q109005		3804 Sandefjord	Sandefjord	"Vestfold og Telemark"	3804	2020	9999
4	Q109021		0104 Moss	Moss	"Østfold"	0104	1838	2020
949	Q109021		3002 Moss	Moss	"Viken"	3002	2020	9999
652	Q109025		1617 Hitra	Hitra	"Sør-Trøndelag"	1617	1838	2018
942	Q109025		5056 Hitra	Hitra	"Trøndelag"	5056	2020	9999
1182	Q109025		5013 Hitra	Hitra	"Trøndelag"	5013	2018	2020
470	Q109031		1235 Voss	Voss	"Hordaland"	1235	1838	2020
1105	Q109031		4621 Voss	Voss	"Vestland"	4621	2020	9999
378	Q109036		1106 Haugesund	Haugesund	"Rogaland"	1106	1855	9999
1	Q109042		0101 Halden	Halden	"Østfold"	0101	1838	2020
948	Q109042		3001 Halden	Halden	"Viken"	3001	2020	9999
200	Q109048		0701 Horten	Horten	"Vestfold"	0701	1988	2020
1045	Q109048		3801 Horten	Horten	"Vestfold og Telemark"	3801	2020	9999
98	Q109140		0427 Elverum	Elverum	"Hedmark"	0427	1838	2020
1012	Q109140		3420 Elverum	Elverum	"Innlandet"	3420	2020	9999
541	Q1094556		1434 Vevring	Vevring	"Sogn og Fjordane"	1434	1838	1964
21	Q109469		0124 Askim	Askim	"Østfold"	0124	1838	2020
35	Q109475		0138 Hobøl	Hobøl	"Østfold"	0138	1838	2020
561	Q109483		1503 Kristiansund	Kristiansund	"Møre og Romsdal"	1503	1838	2008
563	Q109483		1505 Kristiansund	Kristiansund	"Møre og Romsdal"	1505	2008	9999
904	Q109489		2024 Berlevåg	Berlevåg	"Finnmark"	2024	1914	2020
1170	Q109489		5440 Berlevåg	Berlevåg	"Troms og Finnmark"	5440	2020	9999
461	Q109494		1228 Odda	Odda	"Hordaland"	1228	1917	2020
77	Q109499		0402 Kongsvinger	Kongsvinger	"Hedmark"	0402	1855	1964
78	Q109499		0402 Kongsvinger	Kongsvinger	"Hedmark"	0402	1965	2020
91	Q109499		0421 Kongsvinger	Kongsvinger	"Hedmark"	0421	1964	1965
999	Q109499		3401 Kongsvinger	Kongsvinger	"Innlandet"	3401	2020	9999
895	Q109841		2015 Hasvik	Hasvik	"Finnmark"	2015	1853	2020
1163	Q109841		5433 Hasvik	Hasvik	"Troms og Finnmark"	5433	2020	9999
185	Q110268		0625 Nedre Eiker	Nedre Eiker	"Buskerud"	0625	1885	2020
184	Q110311		0624 Øvre Eiker	Øvre Eiker	"Buskerud"	0624	1885	2020
992	Q110311		3048 Øvre Eiker	Øvre Eiker	"Viken"	3048	2020	9999
707	Q110431		1702 Steinkjer	Steinkjer	"Nord-Trøndelag"	1702	1858	2018
1176	Q110431		5004 Steinkjer	Steinkjer	"Trøndelag"	5004	2018	2020
1178	Q110431		5006 Steinkjer	Steinkjer	"Trøndelag"	5006	2020	9999
164	Q110848		0601 Ringerike	Ringerike	"Buskerud"	0601	1964	1977
168	Q110848		0605 Ringerike	Ringerike	"Buskerud"	0605	1977	2020
954	Q110848		3007 Ringerike	Ringerike	"Viken"	3007	2020	9999
708	Q111039		1703 Namsos	Namsos	"Nord-Trøndelag"	1703	1845	2018
1177	Q111039		5005 Namsos	Namsos	"Trøndelag"	5005	2018	2020
1179	Q111039		5007 Namsos	Namsos	"Trøndelag"	5007	2020	9999
776	Q112855		1813 Brønnøy	Brønnøy	"Nordland"	1813	1977	9999
777	Q112855		1814 Brønnøy	Brønnøy	"Nordland"	1814	1838	1977
123	Q113438		0515 Vågå	Vågå	"Oppland"	0515	1838	2020
1027	Q113438		3435 Vågå	Vågå	"Innlandet"	3435	2020	9999
81	Q113466		0412 Ringsaker	Ringsaker	"Hedmark"	0412	1838	2020
1003	Q113466		3411 Ringsaker	Ringsaker	"Innlandet"	3411	2020	9999
454	Q113491		1222 Fitjar	Fitjar	"Hordaland"	1222	1863	2020
1099	Q113491		4615 Fitjar	Fitjar	"Vestland"	4615	2020	9999
823	Q113514		1854 Ballangen	Ballangen	"Nordland"	1854	1925	2020
178	Q113538		0619 Ål	Ål	"Buskerud"	0619	1838	2020
987	Q113538		3043 Ål	Ål	"Viken"	3043	2020	9999
451	Q113552		1219 Bømlo	Bømlo	"Hordaland"	1219	1916	2020
1097	Q113552		4613 Bømlo	Bømlo	"Vestland"	4613	2020	9999
539	Q113571		1432 Førde	Førde	"Sogn og Fjordane"	1432	1838	2020
672	Q113595		1634 Oppdal	Oppdal	"Sør-Trøndelag"	1634	1838	2018
1190	Q113595		5021 Oppdal	Oppdal	"Trøndelag"	5021	2018	9999
18	Q113622		0121 Rømskog	Rømskog	"Østfold"	0121	1902	2020
460	Q113638		1227 Jondal	Jondal	"Hordaland"	1227	1862	2020
908	Q113662		2027 Nesseby	Nesseby	"Finnmark"	2027	1864	2020
1172	Q113662		5442 Nesseby	Nesseby	"Troms og Finnmark"	5442	2020	9999
503	Q113682		1263 Lindås	Lindås	"Hordaland"	1263	1838	2020
898	Q113697		2018 Måsøy	Måsøy	"Finnmark"	2018	1839	2020
1164	Q113697		5434 Måsøy	Måsøy	"Troms og Finnmark"	5434	2020	9999
843	Q113710		1871 Andøy	Andøy	"Nordland"	1871	1964	9999
523	Q113720		1416 Høyanger	Høyanger	"Sogn og Fjordane"	1416	1964	2020
1122	Q113720		4638 Høyanger	Høyanger	"Vestland"	4638	2020	9999
903	Q113729		2023 Gamvik	Gamvik	"Finnmark"	2023	1914	2020
1169	Q113729		5439 Gamvik	Gamvik	"Troms og Finnmark"	5439	2020	9999
22	Q113740		0125 Eidsberg	Eidsberg	"Østfold"	0125	1838	2020
139	Q11961125		0525 Biri	Biri	"Oppland"	0525	1838	1964
698	Q11962892		1658 Børsa	Børsa	"Sør-Trøndelag"	1658	1838	1965
651	Q11968835		1616 Fillan	Fillan	"Sør-Trøndelag"	1616	1886	1964
835	Q11971997		1864 Gimsøy	Gimsøy	"Nordland"	1864	1856	1964
394	Q11972114		1122 Gjestal	Gjestal	"Rogaland"	1122	1838	1965
492	Q11973865		1254 Hamre	Hamre	"Hordaland"	1254	1838	1964
124	Q11974679		0516 Heidal	Heidal	"Oppland"	0516	1908	1965
304	Q11975839		0935 Hornnes og Iveland	Hornnes og Iveland	"Aust-Agder"	0935	1838	1886
436	Q11977004		1156 Imsland	Imsland	"Rogaland"	1156	1923	1965
464	Q11980706		1231 Kinsarvik	Kinsarvik	"Hordaland"	1231	1913	1964
714	Q11991060		1714 Nedre Stjørdalen	Nedre Stjørdalen	"Nord-Trøndelag"	1714	1850	1902
55	Q11991920		0222 Nordre Høland	Nordre Høland	"Akershus"	0222	1924	1966
821	Q11993244		1853 Ofoten	Ofoten	"Nordland"	1853	1838	1884
852	Q11999464		1912 Sandtorg	Sandtorg	"Troms"	1912	1926	1964
225	Q11999900		0721 Sem	Sem	"Vestfold"	0721	1838	1988
595	Q12004542		1536 Tresfjord	Tresfjord	"Møre og Romsdal"	1536	1899	1964
724	Q12011086		1722 Ytterøy	Ytterøy	"Nord-Trøndelag"	1722	1838	1964
769	Q1215658		1805 Narvik	Narvik	"Nordland"	1805	1902	2020
771	Q1215658		1806 Narvik	Narvik	"Nordland"	1806	2020	2020
690	Q1249700		1650 Horg	Horg	"Sør-Trøndelag"	1650	1841	1964
65	Q12716517		0232 Lillestrøm	Lillestrøm	"Akershus"	0232	1908	1962
893	Q12718887		2013 Talvik	Talvik	"Finnmark"	2013	1863	1964
368	Q12719052		1046 Tonstad	Tonstad	"Vest-Agder"	1046	1905	1960
634	Q12719320		1570 Valsøyfjord	Valsøyfjord	"Møre og Romsdal"	1570	1894	1965
883	Q128762		1941 Skjervøy	Skjervøy	"Troms"	1941	1838	2020
1158	Q128762		5427 Skjervøy	Skjervøy	"Troms og Finnmark"	5427	2020	9999
825	Q130048		1856 Røst	Røst	"Nordland"	1856	1928	9999
645	Q1324436		1601 Trondheim	Trondheim	"Sør-Trøndelag"	1601	1838	2018
1175	Q1324436		5001 Trondheim	Trondheim	"Trøndelag"	5001	2018	9999
243	Q1327570		0812 Gjerpen	Gjerpen	"Telemark"	0812	1838	1964
362	Q15070047		1042 Nes og Hitterø	Nes og Hitterø	"Vest-Agder"	1042	1838	1893
435	Q15138687		1155 Vats	Vats	"Rogaland"	1155	1891	1965
879	Q15510890		1937 Ulsfjord	Ullsfjord	"Troms"	1937	1902	1964
207	Q156125		0707 Larvik	Larvik	"Vestfold"	0707	1838	1988
209	Q156125		0709 Larvik	Larvik	"Vestfold"	0709	1988	2018
214	Q156125		0712 Larvik	Larvik	"Vestfold"	0712	2018	2020
1049	Q156125		3805 Larvik	Larvik	"Vestfold og Telemark"	3805	2020	9999
24	Q156420		0127 Skiptvet	Skiptvet	"Østfold"	0127	1838	2020
959	Q156420		3015 Skiptvet	Skiptvet	"Viken"	3015	2020	9999
575	Q156453		1520 Ørsta	Ørsta	"Møre og Romsdal"	1520	1883	9999
748	Q162144		1743 Høylandet	Høylandet	"Nord-Trøndelag"	1743	1901	2018
932	Q162144		5046 Høylandet	Høylandet	"Trøndelag"	5046	2018	9999
495	Q16868941		1257 Alversund	Alversund	"Hordaland"	1257	1885	1964
493	Q16868951		1255 Åsane	Åsane	"Hordaland"	1255	1904	1972
501	Q16894633		1261 Manger	Manger	"Hordaland"	1261	1838	1964
737	Q16897281		1734 Stod	Stod	"Nord-Trøndelag"	1734	1838	1964
36	Q16930411		0194 Jeløy	Jeløy	"Østfold"	0194	1838	1943
462	Q17199178		1229 Røldal	Røldal	"Hordaland"	1229	1838	1964
859	Q175704		1919 Gratangen	Gratangen	"Troms"	1919	1926	2020
1145	Q175704		5414 Gratangen	Gratangen	"Troms og Finnmark"	5414	2020	9999
786	Q1769429		1823 Drevja	Drevja	"Nordland"	1823	1927	1962
219	Q1769464		0716 Våle	Våle	"Vestfold"	0716	1838	2002
854	Q1770083		1914 Trondenes	Trondenes	"Troms"	1914	1838	1964
824	Q1770618		1855 Ankenes	Ankenes	"Nordland"	1855	1884	1974
191	Q1771007		0630 Øvre Sandsvær	Øvre Sandsvær	"Buskerud"	0630	1908	1964
597	Q1771068		1537 Voll	Voll	"Møre og Romsdal"	1537	1874	1964
682	Q1771217		1644 Ålen	Ålen	"Sør-Trøndelag"	1644	1855	1972
798	Q1771274		1833 Nord-Rana	Nord-Rana	"Nordland"	1833	1923	1964
830	Q1771277		1860 Buksnes	Buksnes	"Nordland"	1860	1838	1963
795	Q1771307		1831 Sør-Rana	Sør-Rana	"Nordland"	1831	1929	1964
833	Q1771311		1862 Borge	Borge	"Nordland"	1862	1838	1963
790	Q1771538		1827 Dønnes	Dønnes	"Nordland"	1827	1888	1962
864	Q1771544		1923 Øverbygd	Øverbygd	"Troms"	1923	1925	1964
599	Q1771556		1539 Grytten	Grytten	"Møre og Romsdal"	1539	1838	1964
406	Q1771620		1131 Årdal	Årdal	"Rogaland"	1131	1859	1965
172	Q1772223		0613 Norderhov	Norderhov	"Buskerud"	0613	1838	1964
138	Q1772305		0524 Fåberg	Fåberg	"Oppland"	0524	1838	1964
269	Q1772845		0835 Rauland	Rauland	"Telemark"	0835	1860	1964
735	Q1773214		1732 Ogndal	Ogndal	"Nord-Trøndelag"	1732	1885	1964
450	Q1773710		1218 Moster	Moster	"Hordaland"	1218	1916	1963
901	Q1825		2021 Karasjok	Karasjok	"Finnmark"	2021	1866	2020
1167	Q1825		5437 Karasjok	Karasjok	"Troms og Finnmark"	5437	2020	9999
215	Q183029		0713 Sande	Sande	"Vestfold"	0713	1838	2020
475	Q18385735		1240 Strandvik	Strandvik	"Hordaland"	1240	1903	1964
264	Q1881		0831 Fyresdal	Fyresdal	"Telemark"	0831	1838	2020
1065	Q1881		3823 Fyresdal	Fyresdal	"Vestfold og Telemark"	3823	2020	9999
811	Q1904047		1845 Folden	Folden	"Nordland"	1845	1838	1887
414	Q19376192		1138 Jelsa	Jelsa	"Rogaland"	1138	1838	1965
399	Q19380822		1125 Madla	Madla	"Rogaland"	1125	1930	1965
729	Q19380924		1726 Malm	Malm	"Nord-Trøndelag"	1726	1913	1964
767	Q19381691		1803 Mo	Mo	"Nordland"	1803	1923	1964
906	Q19385537		2026 Polmak	Polmak	"Finnmark"	2026	1903	1964
412	Q19387565		1136 Sand	Sand	"Rogaland"	1136	1859	1965
11	Q19388892		0115 Skjeberg	Skjeberg	"Østfold"	0115	1838	1992
37	Q19389687		0201 Soon og Hølen	Soon og Hølen	"Akershus"	0201	1838	1847
588	Q19397613		1530 Vatne	Vatne	"Møre og Romsdal"	1530	1902	1965
782	Q2003068		1819 Nordvik	Nordvik	"Nordland"	1819	1917	1962
814	Q20112624		1846 Nordfold	Nordfold	"Nordland"	1846	1906	1964
489	Q202605		1252 Modalen	Modalen	"Hordaland"	1252	1910	2020
1113	Q202605		4629 Modalen	Modalen	"Vestland"	4629	2020	9999
279	Q2029826		0914 Holt	Holt	"Aust-Agder"	0914	1838	1960
358	Q20553044		1038 Feda	Feda	"Vest-Agder"	1038	1900	1963
278	Q20553290		0913 Søndeled	Søndeled	"Aust-Agder"	0913	1838	1964
592	Q20553681		1533 Vigra	Vigra	"Møre og Romsdal"	1533	1890	1964
226	Q206469		0722 Nøtterøy	Nøtterøy	"Vestfold"	0722	1838	2018
433	Q20683496		1154 Skjold	Skjold	"Rogaland"	1154	1838	1965
320	Q20932022		1012 Oddernes	Oddernes	"Vest-Agder"	1012	1838	1965
103	Q21141041		0432 Rendalen	Rendalen	"Hedmark"	0432	1838	1880
482	Q215374		1247 Askøy	Askøy	"Hordaland"	1247	1838	2020
1111	Q215374		4627 Askøy	Askøy	"Vestland"	4627	2020	9999
706	Q216430		1701 Levanger	Levanger	"Nord-Trøndelag"	1701	1838	1962
721	Q216430		1719 Levanger	Levanger	"Nord-Trøndelag"	1719	1962	2018
923	Q216430		5037 Levanger	Levanger	"Trøndelag"	5037	2018	9999
514	Q217793		1411 Gulen	Gulen	"Sogn og Fjordane"	1411	1838	2020
1119	Q217793		4635 Gulen	Gulen	"Vestland"	4635	2020	9999
715	Q217802		1714 Stjørdal	Stjørdal	"Nord-Trøndelag"	1714	1902	2018
921	Q217802		5035 Stjørdal	Stjørdal	"Trøndelag"	5035	2018	9999
783	Q217808		1820 Alstahaug	Alstahaug	"Nordland"	1820	1838	9999
768	Q221119		1804 Bodø	Bodø	"Nordland"	1804	1838	9999
263	Q2229		0830 Nissedal	Nissedal	"Telemark"	0830	1838	2020
1064	Q2229		3822 Nissedal	Nissedal	"Vestfold og Telemark"	3822	2020	9999
262	Q2232		0829 Kviteseid	Kviteseid	"Telemark"	0829	1838	2020
1063	Q2232		3821 Kviteseid	Kviteseid	"Vestfold og Telemark"	3821	2020	9999
261	Q2236		0828 Seljord	Seljord	"Telemark"	0828	1838	2020
1062	Q2236		3820 Seljord	Seljord	"Vestfold og Telemark"	3820	2020	9999
267	Q2241		0833 Tokke	Tokke	"Telemark"	0833	1964	2020
1066	Q2241		3824 Tokke	Tokke	"Vestfold og Telemark"	3824	2020	9999
268	Q2245		0834 Vinje	Vinje	"Telemark"	0834	1838	2020
1067	Q2245		3825 Vinje	Vinje	"Vestfold og Telemark"	3825	2020	9999
240	Q2272		0806 Skien	Skien	"Telemark"	0806	1838	2020
1051	Q2272		3807 Skien	Skien	"Vestfold og Telemark"	3807	2020	9999
239	Q2290		0805 Porsgrunn	Porsgrunn	"Telemark"	0805	1838	2020
1050	Q2290		3806 Porsgrunn	Porsgrunn	"Vestfold og Telemark"	3806	2020	9999
425	Q23042303		1147 Avaldsnes	Avaldsnes	"Rogaland"	1147	1866	1965
416	Q23042475		1139 Nedstrand	Nedstrand	"Rogaland"	1139	1868	1965
438	Q23042557		1158 Sandeid	Sandeid	"Rogaland"	1158	1923	1965
446	Q23042667		1215 Vikebygd	Vikebygd	"Hordaland"	1215	1902	1964
437	Q23042668		1157 Vikedal	Vikedal	"Rogaland"	1157	1838	1965
407	Q23044781		1132 Fister	Fister	"Rogaland"	1132	1884	1965
408	Q23044782		1133 Hjelmeland og Fister	Hjelmeland og Fister	"Rogaland"	1133	1838	1884
242	Q2308		0811 Siljan	Siljan	"Telemark"	0811	1838	2020
1054	Q2308		3812 Siljan	Siljan	"Vestfold og Telemark"	3812	2020	9999
241	Q2326		0807 Notodden	Notodden	"Telemark"	0807	1913	2020
1052	Q2326		3808 Notodden	Notodden	"Vestfold og Telemark"	3808	2020	9999
295	Q2340276		0927 Høvåg	Høvåg	"Aust-Agder"	0927	1865	1962
260	Q2354		0827 Hjartdal	Hjartdal	"Telemark"	0827	1838	2020
1061	Q2354		3819 Hjartdal	Hjartdal	"Vestfold og Telemark"	3819	2020	9999
259	Q2365		0826 Tinn	Tinn	"Telemark"	0826	1838	2020
1060	Q2365		3818 Tinn	Tinn	"Vestfold og Telemark"	3818	2020	9999
249	Q2367		0817 Drangedal	Drangedal	"Telemark"	0817	1838	2020
1057	Q2367		3815 Drangedal	Drangedal	"Vestfold og Telemark"	3815	2020	9999
235	Q2372		0801 Kragerø	Kragerø	"Telemark"	0801	1838	1960
247	Q2372		0815 Kragerø	Kragerø	"Telemark"	0815	1960	2020
1056	Q2372		3814 Kragerø	Kragerø	"Vestfold og Telemark"	3814	2020	9999
252	Q2375		0819 Nome	Nome	"Telemark"	0819	1964	2020
1058	Q2375		3816 Nome	Nome	"Vestfold og Telemark"	3816	2020	9999
255	Q2381		0822 Sauherad	Sauherad	"Telemark"	0822	1838	2020
315	Q2415		1001 Kristiansand	Kristiansand	"Vest-Agder"	1001	1838	2020
1071	Q2415		4204 Kristiansand	Kristiansand	"Agder"	4204	2020	9999
409	Q250055		1133 Hjelmeland	Hjelmeland	"Rogaland"	1133	1884	9999
868	Q252381		1926 Dyrøy	Dyrøy	"Troms"	1926	1886	2020
1151	Q252381		5420 Dyrøy	Dyrøy	"Troms og Finnmark"	5420	2020	9999
390	Q25248232		1119 Nærbø	Nærbø	"Rogaland"	1119	1894	1964
387	Q25248233		1117 Ogna	Ogna	"Rogaland"	1117	1839	1964
388	Q25248235		1118 Varhaug	Varhaug	"Rogaland"	1118	1894	1964
385	Q25346053		1115 Helleland	Helleland	"Rogaland"	1115	1838	1965
374	Q25416		1103 Stavanger	Stavanger	"Rogaland"	1103	1838	2020
375	Q25416		1103 Stavanger	Stavanger	"Rogaland"	1103	2020	9999
458	Q25425903		1226 Strandebarm og Varaldsø	Strandebarm og Varaldsø	"Hordaland"	1226	1838	1902
940	Q25428806		5054 Indre Fosen	Indre Fosen	"Trøndelag"	5054	2018	9999
395	Q255148		1122 Gjesdal	Gjesdal	"Rogaland"	1122	1965	9999
775	Q2559864		1813 Velfjord	Velfjord	"Nordland"	1813	1875	1964
832	Q2561326		1861 Hol	Hol	"Nordland"	1861	1919	1963
834	Q2561380		1863 Valberg	Valberg	"Nordland"	1863	1927	1963
747	Q258084		1742 Grong	Grong	"Nord-Trøndelag"	1742	1838	2018
931	Q258084		5045 Grong	Grong	"Trøndelag"	5045	2018	9999
432	Q2605256		1153 Skåre	Skåre	"Rogaland"	1153	1881	1958
849	Q26087		1902 Tromsø	Tromsø	"Troms"	1902	1838	2020
1136	Q26087		5401 Tromsø	Tromsø	"Troms og Finnmark"	5401	2020	9999
165	Q26525		0602 Drammen	Drammen	"Buskerud"	0602	1838	2020
952	Q26525		3005 Drammen	Drammen	"Viken"	3005	2020	9999
667	Q270835		1630 Åfjord	Åfjord	"Sør-Trøndelag"	1630	1838	2018
944	Q270835		5058 Åfjord	Åfjord	"Trøndelag"	5058	2020	9999
1187	Q270835		5018 Åfjord	Åfjord	"Trøndelag"	5018	2018	2020
100	Q271063		0429 Åmot	Åmot	"Hedmark"	0429	1838	2020
1014	Q271063		3422 Åmot	Åmot	"Innlandet"	3422	2020	9999
531	Q271140		1424 Årdal	Årdal	"Sogn og Fjordane"	1424	1863	2020
1127	Q271140		4643 Årdal	Årdal	"Vestland"	4643	2020	9999
313	Q271275		0980 Aaseral	Aaseral	"Aust-Agder"	0980	1838	1880
340	Q271275		1026 Åseral	Åseral	"Vest-Agder"	1026	1880	2020
1088	Q271275		4224 Åseral	Åseral	"Agder"	4224	2020	9999
373	Q27587		1102 Sandnes	Sandnes	"Rogaland"	1102	1861	2020
380	Q27587		1108 Sandnes	Sandnes	"Rogaland"	1108	2020	9999
369	Q281835		1046 Sirdal	Sirdal	"Vest-Agder"	1046	1960	2020
1092	Q281835		4228 Sirdal	Sirdal	"Agder"	4228	2020	9999
383	Q28451397		1113 Heskestad	Heskestad	"Rogaland"	1113	1838	1965
365	Q28452019		1044 Gyland	Gyland	"Vest-Agder"	1044	1893	1965
355	Q28452088		1036 Fjotland	Fjotland	"Vest-Agder"	1036	1858	1963
349	Q28452297		1031 Austad	Austad	"Vest-Agder"	1031	1909	1963
343	Q28452693		1027 Konsmo	Konsmo	"Vest-Agder"	1027	1911	1964
338	Q28452774		1024 Bjelland	Bjelland	"Vest-Agder"	1024	1902	1964
333	Q28452786		1021 Øyslebø	Øyslebø	"Vest-Agder"	1021	1899	1964
335	Q28452788		1022 Laudal	Laudal	"Vest-Agder"	1022	1899	1964
336	Q28452944		1023 Finsland	Finsland	"Vest-Agder"	1023	1838	1964
345	Q28452964		1028 Vigmostad	Vigmostad	"Vest-Agder"	1028	1911	1964
323	Q28453546		1015 Hægeland	Hægeland	"Vest-Agder"	1015	1896	1964
326	Q28453549		1016 Øvrebø	Øvrebø	"Vest-Agder"	1016	1896	1964
321	Q28531127		1013 Tveit	Tveit	"Vest-Agder"	1013	1838	1965
524	Q303521		1417 Vik	Vik	"Sogn og Fjordane"	1417	1838	2020
1123	Q303521		4639 Vik	Vik	"Vestland"	4639	2020	9999
319	Q30598282		1011 Randesund	Randesund	"Vest-Agder"	1011	1893	1965
301	Q30611831		0933 Herefoss	Herefoss	"Aust-Agder"	0933	1838	1967
439	Q308120		1159 Ølen	Ølen	"Rogaland"	1159	2002	2006
445	Q308120		1214 Ølen	Ølen	"Hordaland"	1214	1916	2002
839	Q308134		1868 Øksnes	Øksnes	"Nordland"	1868	1838	9999
658	Q308245		1621 Ørland	Ørland	"Sør-Trøndelag"	1621	1838	2018
943	Q308245		5057 Ørland	Ørland	"Trøndelag"	5057	2020	9999
1184	Q308245		5015 Ørland	Ørland	"Trøndelag"	5015	2018	2020
579	Q308260		1523 Ørskog	Ørskog	"Møre og Romsdal"	1523	1977	2020
584	Q308260		1527 Ørskog	Ørskog	"Møre og Romsdal"	1527	1838	1977
142	Q308420		0528 Østre Toten	Østre Toten	"Oppland"	0528	1838	2020
1034	Q308420		3442 Østre Toten	Østre Toten	"Innlandet"	3442	2020	9999
133	Q316779		0521 Øyer	Øyer	"Oppland"	0521	1838	2020
1032	Q316779		3440 Øyer	Øyer	"Innlandet"	3440	2020	9999
498	Q317321		1259 Øygarden	Øygarden	"Hordaland"	1259	1964	2020
874	Q3199039		1932 Malangen	Malangen	"Troms"	1932	1871	1964
427	Q3296829		1149 Åkra	Åkra	"Rogaland"	1149	1892	1965
160	Q329894		0544 Øystre Slidre	Øystre Slidre	"Oppland"	0544	1849	2020
1043	Q329894		3453 Øystre Slidre	Øystre Slidre	"Innlandet"	3453	2020	9999
518	Q3356229		1414 Brekke	Brekke	"Sogn og Fjordane"	1414	1905	1964
49	Q3357343		0218 Aker	Aker	"Akershus"	0218	1838	1948
331	Q3368682		1020 Holum	Holum	"Vest-Agder"	1020	1838	1964
858	Q3378022		1918 Astafjord	Astafjord	"Troms"	1918	1926	1964
413	Q3420294		1137 Erfjord	Erfjord	"Rogaland"	1137	1914	1965
598	Q3422587		1538 Eid	Eid	"Møre og Romsdal"	1538	1874	1964
400	Q3437377		1126 Hetland	Hetland	"Rogaland"	1126	1838	1965
228	Q3480873		0724 Sandar	Sandar	"Vestfold"	0724	1838	1968
877	Q374421		1935 Helgøy	Helgøy	"Troms"	1935	1886	1964
334	Q378704		1021 Marnardal	Marnardal	"Vest-Agder"	1021	1964	2020
351	Q38249847		1033 Kvås	Kvås	"Vest-Agder"	1033	1909	1963
554	Q383492		1445 Gloppen	Gloppen	"Sogn og Fjordane"	1445	1838	2020
1134	Q383492		4650 Gloppen	Gloppen	"Vestland"	4650	2020	9999
719	Q389371		1718 Leksvik	Leksvik	"Nord-Trøndelag"	1718	1838	2018
659	Q392093		1622 Agdenes	Agdenes	"Sør-Trøndelag"	1622	1896	2018
1185	Q392093		5016 Agdenes	Agdenes	"Trøndelag"	5016	2018	2020
809	Q4098068		1843 Bodin	Bodin	"Nordland"	1843	1838	1968
945	Q41030999		5059 Orkland	Orkland	"Trøndelag"	5059	2020	9999
958	Q42293305		3014 Indre Østfold	Indre Østfold	"Viken"	3014	2020	9999
233	Q42320251		0729 Færder	Færder	"Vestfold"	0729	2018	2020
1053	Q42320251		3811 Færder	Færder	"Vestfold og Telemark"	3811	2020	9999
840	Q4253773		1869 Langenes	Langenes	"Nordland"	1869	1919	1964
815	Q4257520		1847 Leiranger	Leiranger	"Nordland"	1847	1900	1964
284	Q425809		0918 Austre Moland	Austre Moland	"Aust-Agder"	0918	1838	1962
813	Q4328174		1846 Nordfolden-Kjerringø	Nordfolden-Kjerringø	"Nordland"	1846	1887	1906
668	Q4461072		1631 Stoksund	Stoksund	"Sør-Trøndelag"	1631	1892	1964
964	Q45303406		3020 Nordre Follo	Nordre Follo	"Viken"	3020	2020	9999
694	Q4559189		1654 Leinstrand	Leinstrand	"Sør-Trøndelag"	1654	1838	1964
695	Q4560616		1655 Byneset	Byneset	"Sør-Trøndelag"	1655	1838	1964
696	Q4562853		1656 Buvik	Buvik	"Sør-Trøndelag"	1656	1855	1965
441	Q4579354		1201 Bergen	Bergen	"Hordaland"	1201	1972	2020
511	Q4579354		1301 Bergen	Bergen	"Bergen"	1301	1070	1972
1093	Q4579354		4601 Bergen	Bergen	"Vestland"	4601	2020	9999
509	Q4579354		1281 Dom- og Korskirkens Landdistrikt	Dom- og Korskirkens Landdistrikt	"Hordaland"	1281	1838	1877
379	Q4582293		1107 Sogndal	Sogndal	"Rogaland"	1107	1845	1944
650	Q4587537		1615 Sandstad	Sandstad	"Sør-Trøndelag"	1615	1914	1964
639	Q4588149		1574 Brattvær	Brattvær	"Møre og Romsdal"	1574	1915	1960
449	Q4588258		1218 Finnaas	Finnaas	"Hordaland"	1218	1838	1916
499	Q4588449		1260 Hordabø	Hordabø	"Hordaland"	1260	1924	1964
637	Q4588478		1573 Edøy	Edøy	"Møre og Romsdal"	1573	1838	1960
709	Q4588515		1711 Øvre Stjørdalen	Øvre Stjørdalen	"Nord-Trøndelag"	1711	1850	1874
589	Q4588533		1531 Borgund	Borgund	"Møre og Romsdal"	1531	1838	1968
573	Q4588594		1518 Dalsfjord	Dalsfjord	"Møre og Romsdal"	1518	1924	1964
555	Q4588602		1446 Breim	Breim	"Sogn og Fjordane"	1446	1886	1964
603	Q4588612		1542 Eresfjord og Vistdal	Eresfjord og Vistdal	"Møre og Romsdal"	1542	1890	1964
266	Q4588680		0833 Lårdal	Lårdal	"Telemark"	0833	1838	1964
520	Q4588688		1415 Lavik og Brekke	Lavik og Brekke	"Sogn og Fjordane"	1415	1861	1905
510	Q4588697		1282 Eid	Eid	"Hordaland"	1282	1838	1855
521	Q4588733		1415 Lavik	Lavik	"Sogn og Fjordane"	1415	1905	1964
251	Q4588743		0819 Holla	Holla	"Telemark"	0819	1838	1964
265	Q4588828		0832 Mo	Mo	"Telemark"	0832	1838	1964
615	Q4589241		1552 Kornstad	Kornstad	"Møre og Romsdal"	1552	1897	1964
490	Q4589269		1253 Hosanger	Hosanger	"Hordaland"	1253	1838	1964
534	Q4591667		1427 Jostedal	Jostedal	"Sogn og Fjordane"	1427	1838	1963
481	Q473529		1246 Fjell	Fjell	"Hordaland"	1246	1838	2020
891	Q4735943		2012 Alten-Talvik	Alten-Talvik	"Finnmark"	2012	1838	1863
486	Q4794387		1250 Arna	Arna	"Hordaland"	1250	1964	1972
660	Q48057078		1623 Lensvik	Lensvik	"Sør-Trøndelag"	1623	1905	1964
587	Q48265		1529 Skodje	Skodje	"Møre og Romsdal"	1529	1977	2020
756	Q48276		1749 Flatanger	Flatanger	"Nord-Trøndelag"	1749	1871	2018
935	Q48276		5049 Flatanger	Flatanger	"Trøndelag"	5049	2018	9999
505	Q48299		1265 Masfjorden	Masfjorden	"Hordaland"	1265	1879	1947
507	Q48299		1266 Masfjorden	Masfjorden	"Hordaland"	1266	1947	2020
1118	Q48299		4634 Masfjorden	Masfjorden	"Vestland"	4634	2020	9999
455	Q48316		1223 Tysnes	Tysnes	"Hordaland"	1223	1838	2020
1100	Q48316		4616 Tysnes	Tysnes	"Vestland"	4616	2020	9999
803	Q48323		1837 Meløy	Meløy	"Nordland"	1837	1884	9999
867	Q48325		1925 Sørreisa	Sørreisa	"Troms"	1925	1886	2020
1150	Q48325		5419 Sørreisa	Sørreisa	"Troms og Finnmark"	5419	2020	9999
855	Q48333		1915 Bjarkøy	Bjarkøy	"Troms"	1915	1838	2013
800	Q48341		1834 Lurøy	Lurøy	"Nordland"	1834	1838	9999
201	Q483871		0702 Holmestrand	Holmestrand	"Vestfold"	0702	1838	2018
218	Q483871		0715 Holmestrand	Holmestrand	"Vestfold"	0715	2018	2020
1046	Q483871		3802 Holmestrand	Holmestrand	"Vestfold og Telemark"	3802	2020	9999
372	Q483877		1101 Eigersund	Eigersund	"Rogaland"	1101	1965	9999
386	Q483877		1116 Eigersund	Eigersund	"Rogaland"	1116	1838	1965
900	Q483885		2020 Porsanger	Porsanger	"Finnmark"	2020	1838	2020
1166	Q483885		5436 Porsanger	Porsanger	"Troms og Finnmark"	5436	2020	9999
638	Q483899		1573 Smøla	Smøla	"Møre og Romsdal"	1573	1960	9999
428	Q483902		1149 Karmøy	Karmøy	"Rogaland"	1149	1965	9999
32	Q483906		0135 Råde	Råde	"Østfold"	0135	1838	2020
961	Q483906		3017 Råde	Råde	"Viken"	3017	2020	9999
193	Q483911		0632 Rollag	Rollag	"Buskerud"	0632	1838	2020
995	Q483911		3051 Rollag	Rollag	"Viken"	3051	2020	9999
14	Q48393		0118 Aremark	Aremark	"Østfold"	0118	1838	2020
956	Q48393		3012 Aremark	Aremark	"Viken"	3012	2020	9999
905	Q483964		2025 Tana	Tana	"Finnmark"	2025	1864	2020
1171	Q483964		5441 Tana	Tana	"Troms og Finnmark"	5441	2020	9999
25	Q483969		0128 Rakkestad	Rakkestad	"Østfold"	0128	1838	2020
960	Q483969		3016 Rakkestad	Rakkestad	"Viken"	3016	2020	9999
467	Q483977		1232 Eidfjord	Eidfjord	"Hordaland"	1232	1977	2020
1103	Q483977		4619 Eidfjord	Eidfjord	"Vestland"	4619	2020	9999
984	Q483986		3040 Nesbyen	Nesbyen	"Viken"	3040	2020	9999
182	Q484001		0623 Modum	Modum	"Buskerud"	0623	1838	2020
991	Q484001		3047 Modum	Modum	"Viken"	3047	2020	9999
479	Q484008		1244 Austevoll	Austevoll	"Hordaland"	1244	1886	2020
1109	Q484008		4625 Austevoll	Austevoll	"Vestland"	4625	2020	9999
838	Q484012		1867 Bø	Bø	"Nordland"	1867	1838	9999
837	Q484043		1866 Hadsel	Hadsel	"Nordland"	1866	1838	9999
604	Q484046		1543 Nesset	Nesset	"Møre og Romsdal"	1543	1838	2020
245	Q484052		0814 Bamble	Bamble	"Telemark"	0814	1838	2020
1055	Q484052		3813 Bamble	Bamble	"Vestfold og Telemark"	3813	2020	9999
179	Q484057		0620 Hol	Hol	"Buskerud"	0620	1877	2020
988	Q484057		3044 Hol	Hol	"Viken"	3044	2020	9999
114	Q484064		0439 Folldal	Folldal	"Hedmark"	0439	1914	2020
1021	Q484064		3429 Folldal	Folldal	"Innlandet"	3429	2020	9999
456	Q484070		1224 Kvinnherad	Kvinnherad	"Hordaland"	1224	1838	2020
1101	Q484070		4617 Kvinnherad	Kvinnherad	"Vestland"	4617	2020	9999
157	Q484074		0542 Nord-Aurdal	Nord-Aurdal	"Oppland"	0542	1838	2020
1041	Q484074		3451 Nord-Aurdal	Nord-Aurdal	"Innlandet"	3451	2020	9999
463	Q484077		1230 Ullensvang	Ullensvang	"Hordaland"	1230	1838	1977
465	Q484077		1231 Ullensvang	Ullensvang	"Hordaland"	1231	1977	2020
504	Q484080		1264 Austrheim	Austrheim	"Hordaland"	1264	1910	2020
1116	Q484080		4632 Austrheim	Austrheim	"Vestland"	4632	2020	9999
683	Q484084		1644 Holtålen	Holtålen	"Sør-Trøndelag"	1644	1972	2018
912	Q484084		5026 Holtålen	Holtålen	"Trøndelag"	5026	2018	9999
744	Q484088		1739 Røyrvik	Røyrvik	"Nord-Trøndelag"	1739	1923	9999
929	Q484088		5043 Røyrvik	Røyrvik	"Trøndelag"	5043	2018	9999
151	Q484093		0536 Søndre Land	Søndre Land	"Oppland"	0536	1847	2020
1037	Q484093		3447 Søndre Land	Søndre Land	"Innlandet"	3447	2020	9999
812	Q484097		1845 Sørfold	Sørfold	"Nordland"	1845	1887	9999
538	Q484101		1431 Jølster	Jølster	"Sogn og Fjordane"	1431	1838	2020
702	Q484106		1662 Klæbu	Klæbu	"Sør-Trøndelag"	1662	1838	2018
916	Q484106		5030 Klæbu	Klæbu	"Trøndelag"	5030	2018	9999
618	Q484111		1554 Averøy	Averøy	"Møre og Romsdal"	1554	1964	9999
121	Q484116		0513 Skjåk	Skjåk	"Oppland"	0513	1866	2020
1025	Q484116		3433 Skjåk	Skjåk	"Innlandet"	3433	2020	9999
657	Q484119		1620 Frøya	Frøya	"Sør-Trøndelag"	1620	1964	2018
1183	Q484119		5014 Frøya	Frøya	"Trøndelag"	5014	2018	9999
611	Q484128		1548 Fræna	Fræna	"Møre og Romsdal"	1548	1840	2020
155	Q48414		0540 Sør-Aurdal	Sør-Aurdal	"Oppland"	0540	1838	2020
1039	Q48414		3449 Sør-Aurdal	Sør-Aurdal	"Innlandet"	3449	2020	9999
469	Q484186		1234 Granvin	Granvin	"Hordaland"	1234	1891	2020
674	Q484191		1636 Meldal	Meldal	"Sør-Trøndelag"	1636	1838	2018
1192	Q484191		5023 Meldal	Meldal	"Trøndelag"	5023	2018	2020
804	Q484208		1838 Gildeskål	Gildeskål	"Nordland"	1838	1838	9999
506	Q484213		1265 Fedje	Fedje	"Hordaland"	1265	1947	2020
1117	Q484213		4633 Fedje	Fedje	"Vestland"	4633	2020	9999
87	Q484218		0418 Nord-Odal	Nord-Odal	"Hedmark"	0418	1838	2020
1006	Q484218		3414 Nord-Odal	Nord-Odal	"Innlandet"	3414	2020	9999
664	Q484243		1627 Bjugn	Bjugn	"Sør-Trøndelag"	1627	1853	2018
1186	Q484243		5017 Bjugn	Bjugn	"Trøndelag"	5017	2018	2020
819	Q484252		1851 Lødingen	Lødingen	"Nordland"	1851	1838	9999
671	Q484257		1633 Osen	Osen	"Sør-Trøndelag"	1633	1892	2018
1189	Q484257		5020 Osen	Osen	"Trøndelag"	5020	2018	9999
404	Q484309		1129 Forsand	Forsand	"Rogaland"	1129	1871	2020
549	Q484313		1441 Selje	Selje	"Sogn og Fjordane"	1441	1838	2020
799	Q484322		1833 Rana	Rana	"Nordland"	1833	1964	9999
941	Q48475310		5055 Heim	Heim	"Trøndelag"	5055	2020	9999
366	Q4849471		1045 Bakke	Bakke	"Vest-Agder"	1045	1838	1965
581	Q48501		1525 Stranda	Stranda	"Møre og Romsdal"	1525	1838	9999
585	Q48508		1528 Sykkylven	Sykkylven	"Møre og Romsdal"	1528	1883	9999
447	Q48518		1216 Sveio	Sveio	"Hordaland"	1216	1852	2020
1096	Q48518		4612 Sveio	Sveio	"Vestland"	4612	2020	9999
627	Q48521		1563 Sunndal	Sunndal	"Møre og Romsdal"	1563	1838	9999
453	Q485253		1221 Stord	Stord	"Hordaland"	1221	1838	2020
1098	Q485253		4614 Stord	Stord	"Vestland"	4614	2020	9999
101	Q48526		0430 Stor-Elvdal	Stor-Elvdal	"Hedmark"	0430	1838	2020
1015	Q48526		3423 Stor-Elvdal	Stor-Elvdal	"Innlandet"	3423	2020	9999
99	Q48529		0428 Trysil	Trysil	"Hedmark"	0428	1838	2020
1013	Q48529		3421 Trysil	Trysil	"Innlandet"	3421	2020	9999
411	Q485297		1135 Sauda	Sauda	"Rogaland"	1135	1842	9999
86	Q48542		0417 Stange	Stange	"Hedmark"	0417	1838	2020
1005	Q48542		3413 Stange	Stange	"Innlandet"	3413	2020	9999
630	Q48545		1566 Surnadal	Surnadal	"Møre og Romsdal"	1566	1838	9999
583	Q48560		1526 Stordal	Stordal	"Møre og Romsdal"	1526	1977	2020
391	Q485608		1119 Hå	Hå	"Rogaland"	1119	1964	9999
648	Q48568		1613 Snillfjord	Snillfjord	"Sør-Trøndelag"	1613	1924	2018
1181	Q48568		5012 Snillfjord	Snillfjord	"Trøndelag"	5012	2018	2020
410	Q48577		1134 Suldal	Suldal	"Rogaland"	1134	1838	9999
870	Q48581		1928 Torsken	Torsken	"Troms"	1928	1902	2020
405	Q48591		1130 Strand	Strand	"Rogaland"	1130	1838	9999
869	Q48597		1927 Tranøy	Tranøy	"Troms"	1927	1838	2020
774	Q48610		1812 Sømna	Sømna	"Nordland"	1812	1977	9999
88	Q48615		0419 Sør-Odal	Sør-Odal	"Hedmark"	0419	1838	2020
1007	Q48615		3415 Sør-Odal	Sør-Odal	"Innlandet"	3415	2020	9999
801	Q48620		1835 Træna	Træna	"Nordland"	1835	1872	9999
826	Q48629		1857 Værøy	Værøy	"Nordland"	1857	1838	9999
132	Q48637		0520 Ringebu	Ringebu	"Oppland"	0520	1838	2020
1031	Q48637		3439 Ringebu	Ringebu	"Innlandet"	3439	2020	9999
515	Q48647		1412 Solund	Solund	"Sogn og Fjordane"	1412	1858	2020
1120	Q48647		4636 Solund	Solund	"Vestland"	4636	2020	9999
881	Q48657		1939 Storfjord	Storfjord	"Troms"	1939	1929	2020
1156	Q48657		5425 Storfjord	Storfjord	"Troms og Finnmark"	5425	2020	9999
119	Q486677		0511 Dovre	Dovre	"Oppland"	0511	1863	2020
1023	Q486677		3431 Dovre	Dovre	"Innlandet"	3431	2020	9999
20	Q48668		0123 Spydeberg	Spydeberg	"Østfold"	0123	1838	2020
223	Q486687		0719 Andebu	Andebu	"Vestfold"	0719	1838	2017
33	Q486696		0136 Rygge	Rygge	"Østfold"	0136	1838	2020
528	Q486700		1421 Aurland	Aurland	"Sogn og Fjordane"	1421	1838	2020
1125	Q486700		4641 Aurland	Aurland	"Vestland"	4641	2020	9999
146	Q486704		0532 Jevnaker	Jevnaker	"Oppland"	0532	1838	2020
997	Q486704		3053 Jevnaker	Jevnaker	"Viken"	3053	2020	9999
136	Q486713		0522 Gausdal	Gausdal	"Oppland"	0522	1962	2020
1033	Q486713		3441 Gausdal	Gausdal	"Innlandet"	3441	2020	9999
875	Q486717		1933 Balsfjord	Balsfjord	"Troms"	1933	1860	2020
1153	Q486717		5422 Balsfjord	Balsfjord	"Troms og Finnmark"	5422	2020	9999
180	Q486726		0621 Sigdal	Sigdal	"Buskerud"	0621	1838	2020
989	Q486726		3045 Sigdal	Sigdal	"Viken"	3045	2020	9999
16	Q486736		0119 Marker	Marker	"Østfold"	0119	1964	2020
957	Q486736		3013 Marker	Marker	"Viken"	3013	2020	9999
153	Q486741		0538 Nordre Land	Nordre Land	"Oppland"	0538	1847	2020
1038	Q486741		3448 Nordre Land	Nordre Land	"Innlandet"	3448	2020	9999
19	Q48678		0122 Trøgstad	Trøgstad	"Østfold"	0122	1838	2020
227	Q48687		0723 Tjøme	Tjøme	"Vestfold"	0723	1838	2018
807	Q48696		1841 Fauske	Fauske	"Nordland"	1841	1905	9999
199	Q48701		0701 Svelvik	Svelvik	"Vestfold"	0701	1845	1964
212	Q48701		0711 Svelvik	Svelvik	"Vestfold"	0711	1964	2020
143	Q48717		0529 Vestre Toten	Vestre Toten	"Oppland"	0529	1838	2020
1035	Q48717		3443 Vestre Toten	Vestre Toten	"Innlandet"	3443	2020	9999
113	Q48723		0438 Alvdal	Alvdal	"Hedmark"	0438	1864	2020
1020	Q48723		3428 Alvdal	Alvdal	"Innlandet"	3428	2020	9999
878	Q48728		1936 Karlsøy	Karlsøy	"Troms"	1936	1838	2020
1154	Q48728		5423 Karlsøy	Karlsøy	"Troms og Finnmark"	5423	2020	9999
710	Q48732		1711 Meråker	Meråker	"Nord-Trøndelag"	1711	1874	2018
920	Q48732		5034 Meråker	Meråker	"Trøndelag"	5034	2018	9999
418	Q48750		1141 Finnøy	Finnøy	"Rogaland"	1141	1838	2020
805	Q487524		1839 Beiarn	Beiarn	"Nordland"	1839	1853	9999
473	Q487529		1238 Kvam	Kvam	"Hordaland"	1238	1838	2020
1106	Q487529		4622 Kvam	Kvam	"Vestland"	4622	2020	9999
817	Q487538		1849 Hamarøy	Hamarøy	"Nordland"	1849	1838	2020
847	Q487538		1875 Hamarøy	Hamarøy	"Nordland"	1875	2020	9999
902	Q48760		2022 Lebesby	Lebesby	"Finnmark"	2022	1838	2020
1168	Q48760		5438 Lebesby	Lebesby	"Troms og Finnmark"	5438	2020	9999
827	Q487636		1858 Moskenes	Moskenes	"Nordland"	1858	1916	1976
846	Q487636		1874 Moskenes	Moskenes	"Nordland"	1874	1976	9999
96	Q48769		0425 Åsnes	Åsnes	"Hedmark"	0425	1854	2020
1010	Q48769		3418 Åsnes	Åsnes	"Innlandet"	3418	2020	9999
468	Q487711		1233 Ulvik	Ulvik	"Hordaland"	1233	1838	2020
1104	Q487711		4620 Ulvik	Ulvik	"Vestland"	4620	2020	9999
442	Q48782		1211 Etne	Etne	"Hordaland"	1211	1838	2020
1095	Q48782		4611 Etne	Etne	"Vestland"	4611	2020	9999
609	Q48794		1546 Sandøy	Sandøy	"Møre og Romsdal"	1546	1867	2020
820	Q48801		1852 Tjeldsund	Tjeldsund	"Nordland"	1852	1909	2020
1143	Q48801		5412 Tjeldsund	Tjeldsund	"Troms og Finnmark"	5412	2020	9999
69	Q488026		0236 Nes	Nes	"Akershus"	0236	1838	2020
175	Q488026		0616 Nes	Nes	"Buskerud"	0616	1838	2020
978	Q488026		3034 Nes	Nes	"Viken"	3034	2020	9999
802	Q488046		1836 Rødøy	Rødøy	"Nordland"	1836	1838	9999
156	Q488049		0541 Etnedal	Etnedal	"Oppland"	0541	1894	2020
1040	Q488049		3450 Etnedal	Etnedal	"Innlandet"	3450	2020	9999
131	Q488054		0519 Sør-Fron	Sør-Fron	"Oppland"	0519	1977	2020
1030	Q488054		3438 Sør-Fron	Sør-Fron	"Innlandet"	3438	2020	9999
594	Q488060		1535 Vestnes	Vestnes	"Møre og Romsdal"	1535	1838	9999
491	Q488067		1253 Osterøy	Osterøy	"Hordaland"	1253	1964	2020
1114	Q488067		4630 Osterøy	Osterøy	"Vestland"	4630	2020	9999
673	Q488124		1635 Rennebu	Rennebu	"Sør-Trøndelag"	1635	1839	2018
1191	Q488124		5022 Rennebu	Rennebu	"Trøndelag"	5022	2018	9999
909	Q48813		2028 Båtsfjord	Båtsfjord	"Finnmark"	2028	1838	2020
1173	Q48813		5443 Båtsfjord	Båtsfjord	"Troms og Finnmark"	5443	2020	9999
661	Q488157		1624 Rissa	Rissa	"Sør-Trøndelag"	1624	1860	2018
13	Q4882085		0117 Idd	Idd	"Østfold"	0117	1838	1967
105	Q488229		0432 Rendalen	Rendalen	"Hedmark"	0432	1965	2020
1016	Q488229		3424 Rendalen	Rendalen	"Innlandet"	3424	2020	9999
477	Q488234		1242 Samnanger	Samnanger	"Hordaland"	1242	1907	2020
1107	Q488234		4623 Samnanger	Samnanger	"Vestland"	4623	2020	9999
631	Q488242		1567 Rindal	Rindal	"Møre og Romsdal"	1567	1858	2020
947	Q488242		5061 Rindal	Rindal	"Trøndelag"	5061	2019	9999
635	Q488247		1571 Halsa	Halsa	"Møre og Romsdal"	1571	1838	2020
624	Q488252		1560 Tingvoll	Tingvoll	"Møre og Romsdal"	1560	1838	9999
857	Q488258		1917 Ibestad	Ibestad	"Troms"	1917	1838	2020
1144	Q488258		5413 Ibestad	Ibestad	"Troms og Finnmark"	5413	2020	9999
911	Q48827		2030 Sør-Varanger	Sør-Varanger	"Finnmark"	2030	1858	2020
1174	Q48827		5444 Sør-Varanger	Sør-Varanger	"Troms og Finnmark"	5444	2020	9999
757	Q48833		1750 Vikna	Vikna	"Nord-Trøndelag"	1750	1869	2018
936	Q48833		5050 Vikna	Vikna	"Trøndelag"	5050	2018	2020
778	Q488375		1815 Vega	Vega	"Nordland"	1815	1838	9999
608	Q488380		1545 Midsund	Midsund	"Møre og Romsdal"	1545	1965	2020
789	Q488384		1826 Hattfjelldal	Hattfjelldal	"Nordland"	1826	1862	9999
647	Q488388		1612 Hemne	Hemne	"Sør-Trøndelag"	1612	1838	2018
1180	Q488388		5011 Hemne	Hemne	"Trøndelag"	5011	2018	2020
494	Q488392		1256 Meland	Meland	"Hordaland"	1256	1923	2020
122	Q488395		0514 Lom	Lom	"Oppland"	0514	1838	2020
1026	Q488395		3434 Lom	Lom	"Innlandet"	3434	2020	9999
147	Q488398		0533 Lunner	Lunner	"Oppland"	0533	1898	2020
998	Q488398		3054 Lunner	Lunner	"Viken"	3054	2020	9999
125	Q488401		0516 Nord-Fron	Nord-Fron	"Oppland"	0516	1977	2020
1028	Q488401		3436 Nord-Fron	Nord-Fron	"Innlandet"	3436	2020	9999
116	Q488401		0441 Os	Os	"Hedmark"	0441	1976	2020
120	Q488405		0512 Lesja	Lesja	"Oppland"	0512	1838	2020
1024	Q488405		3432 Lesja	Lesja	"Innlandet"	3432	2020	9999
7	Q488435		0111 Hvaler	Hvaler	"Østfold"	0111	1838	2020
955	Q488435		3011 Hvaler	Hvaler	"Viken"	3011	2020	9999
159	Q488439		0543 Vestre Slidre	Vestre Slidre	"Oppland"	0543	1849	2020
1042	Q488439		3452 Vestre Slidre	Vestre Slidre	"Innlandet"	3452	2020	9999
841	Q48844		1870 Sortland	Sortland	"Nordland"	1870	1841	9999
574	Q488445		1519 Volda	Volda	"Møre og Romsdal"	1519	1838	2020
642	Q488445		1577 Volda	Volda	"Møre og Romsdal"	1577	2020	9999
894	Q48848		2014 Loppa	Loppa	"Finnmark"	2014	1838	2020
1162	Q48848		5432 Loppa	Loppa	"Troms og Finnmark"	5432	2020	9999
381	Q48858		1111 Sokndal	Sokndal	"Rogaland"	1111	1838	9999
186	Q488607		0626 Lier	Lier	"Buskerud"	0626	1838	2020
993	Q488607		3049 Lier	Lier	"Viken"	3049	2020	9999
188	Q488611		0628 Hurum	Hurum	"Buskerud"	0628	1838	2020
171	Q488622		0612 Hole	Hole	"Buskerud"	0612	1977	2020
982	Q488622		3038 Hole	Hole	"Viken"	3038	2020	9999
187	Q488663		0627 Røyken	Røyken	"Buskerud"	0627	1838	2020
785	Q48870		1822 Leirfjord	Leirfjord	"Nordland"	1822	1915	9999
356	Q488747		1037 Kvinesdal	Kvinesdal	"Vest-Agder"	1037	1838	1900
357	Q488747		1037 Kvinesdal	Kvinesdal	"Vest-Agder"	1037	1900	2020
1091	Q488747		4227 Kvinesdal	Kvinesdal	"Agder"	4227	2020	9999
693	Q488762		1653 Melhus	Melhus	"Sør-Trøndelag"	1653	1838	2018
914	Q488762		5028 Melhus	Melhus	"Trøndelag"	5028	2018	9999
796	Q488776		1832 Hemnes	Hemnes	"Nordland"	1832	1838	9999
112	Q488779		0437 Tynset	Tynset	"Hedmark"	0437	1838	2020
1019	Q488779		3427 Tynset	Tynset	"Innlandet"	3427	2020	9999
93	Q488783		0423 Grue	Grue	"Hedmark"	0423	1838	2020
1009	Q488783		3417 Grue	Grue	"Innlandet"	3417	2020	9999
806	Q48880		1840 Saltdal	Saltdal	"Nordland"	1840	1838	9999
691	Q4888599		1651 Hølonda	Hølonda	"Sør-Trøndelag"	1651	1865	1964
181	Q48886		0622 Krødsherad	Krødsherad	"Buskerud"	0622	1901	2020
990	Q48886		3046 Krødsherad	Krødsherad	"Viken"	3046	2020	9999
398	Q488948		1124 Sola	Sola	"Rogaland"	1124	1930	9999
84	Q488951		0415 Løten	Løten	"Hedmark"	0415	1838	2020
1004	Q488951		3412 Løten	Løten	"Innlandet"	3412	2020	9999
866	Q488955		1924 Målselv	Målselv	"Troms"	1924	1848	2020
1149	Q488955		5418 Målselv	Målselv	"Troms og Finnmark"	5418	2020	9999
885	Q488959		1943 Kvænangen	Kvænangen	"Troms"	1943	1863	2020
1160	Q488959		5429 Kvænangen	Kvænangen	"Troms og Finnmark"	5429	2020	9999
352	Q488962		1034 Hægebostad	Hægebostad	"Vest-Agder"	1034	1838	2020
1090	Q488962		4226 Hægebostad	Hægebostad	"Agder"	4226	2020	9999
500	Q488966		1260 Radøy	Radøy	"Hordaland"	1260	1964	2020
822	Q48897		1853 Evenes	Evenes	"Nordland"	1853	1884	9999
732	Q488970		1729 Inderøy	Inderøy	"Nord-Trøndelag"	1729	1838	2012
764	Q488970		1756 Inderøy	Inderøy	"Nord-Trøndelag"	1756	2012	2018
939	Q488970		5053 Inderøy	Inderøy	"Trøndelag"	5053	2018	9999
529	Q488975		1422 Lærdal	Lærdal	"Sogn og Fjordane"	1422	1838	2020
1126	Q488975		4642 Lærdal	Lærdal	"Vestland"	4642	2020	9999
758	Q488979		1751 Nærøy	Nærøy	"Nord-Trøndelag"	1751	1838	2018
937	Q488979		5051 Nærøy	Nærøy	"Trøndelag"	5051	2018	2020
347	Q489038		1029 Lindesnes	Lindesnes	"Vest-Agder"	1029	1964	2020
107	Q48909		0434 Engerdal	Engerdal	"Hedmark"	0434	1911	2020
1017	Q48909		3425 Engerdal	Engerdal	"Innlandet"	3425	2020	9999
89	Q48913		0420 Eidskog	Eidskog	"Hedmark"	0420	1864	2020
1008	Q48913		3416 Eidskog	Eidskog	"Innlandet"	3416	2020	9999
12	Q4891388		0116 Berg	Berg	"Østfold"	0116	1838	1967
195	Q48924		0633 Nore og Uvdal	Nore og Uvdal	"Buskerud"	0633	1962	2020
996	Q48924		3052 Nore og Uvdal	Nore og Uvdal	"Viken"	3052	2020	9999
653	Q48925358		1618 Kvenvær	Kvenvær	"Sør-Trøndelag"	1618	1913	1964
488	Q48928		1251 Vaksdal	Vaksdal	"Hordaland"	1251	1964	2020
1112	Q48928		4628 Vaksdal	Vaksdal	"Vestland"	4628	2020	9999
610	Q489342		1547 Aukra	Aukra	"Møre og Romsdal"	1547	1924	9999
791	Q489347		1827 Dønna	Dønna	"Nordland"	1827	1962	9999
422	Q489351		1145 Bokn	Bokn	"Rogaland"	1145	1849	9999
772	Q489362		1811 Bindal	Bindal	"Nordland"	1811	1837	9999
718	Q489374		1717 Frosta	Frosta	"Nord-Trøndelag"	1717	1838	2018
922	Q489374		5036 Frosta	Frosta	"Trøndelag"	5036	2018	9999
443	Q48967850		1212 Skånevik	Skånevik	"Hordaland"	1212	1838	1965
502	Q48968367		1262 Sæbø	Sæbø	"Hordaland"	1262	1924	1964
300	Q48988061		0932 Mykland	Mykland	"Aust-Agder"	0932	1876	1967
681	Q48989656		1643 Glåmos	Glåmos	"Sør-Trøndelag"	1643	1926	1964
680	Q48989658		1642 Brekken	Brekken	"Sør-Trøndelag"	1642	1926	1964
684	Q48989702		1645 Haltdalen	Haltdalen	"Sør-Trøndelag"	1645	1838	1972
685	Q48989725		1646 Singsås	Singsås	"Sør-Trøndelag"	1646	1841	1964
687	Q48989727		1648 Støren	Støren	"Sør-Trøndelag"	1648	1838	1964
689	Q48989729		1649 Soknedal	Soknedal	"Sør-Trøndelag"	1649	1841	1964
853	Q490038		1913 Skånland	Skånland	"Troms"	1913	1926	2020
836	Q490246		1865 Vågan	Vågan	"Nordland"	1865	1838	9999
317	Q490462		1003 Farsund	Farsund	"Vest-Agder"	1003	1838	2020
1073	Q490462		4206 Farsund	Farsund	"Agder"	4206	2020	9999
527	Q490923		1420 Sogndal	Sogndal	"Sogn og Fjordane"	1420	1838	2020
1124	Q490923		4640 Sogndal	Sogndal	"Vestland"	4640	2020	9999
337	Q4919599		1024 Bjelland og Grindum	Bjelland og Grindum	"Vest-Agder"	1024	1838	1902
669	Q4919985		1632 Bjørnør	Bjørnør	"Sør-Trøndelag"	1632	1838	1892
401	Q492115		1127 Randaberg	Randaberg	"Rogaland"	1127	1922	9999
704	Q492209		1664 Selbu	Selbu	"Sør-Trøndelag"	1664	1838	2018
918	Q492209		5032 Selbu	Selbu	"Trøndelag"	5032	2018	9999
688	Q492244		1648 Midtre Gauldal	Midtre Gauldal	"Sør-Trøndelag"	1648	1964	2018
913	Q492244		5027 Midtre Gauldal	Midtre Gauldal	"Trøndelag"	5027	2018	9999
897	Q493007		2017 Kvalsund	Kvalsund	"Finnmark"	2017	1869	2020
537	Q493273		1430 Gaular	Gaular	"Sogn og Fjordane"	1430	1838	2020
476	Q493279		1241 Fusa	Fusa	"Hordaland"	1241	1856	2020
621	Q493283		1557 Gjemnes	Gjemnes	"Møre og Romsdal"	1557	1893	9999
525	Q493292		1418 Balestrand	Balestrand	"Sogn og Fjordane"	1418	1850	2020
614	Q493296		1551 Eide	Eide	"Møre og Romsdal"	1551	1897	2020
176	Q493301		0617 Gol	Gol	"Buskerud"	0617	1838	2020
985	Q493301		3041 Gol	Gol	"Viken"	3041	2020	9999
384	Q493308		1114 Bjerkreim	Bjerkreim	"Rogaland"	1114	1838	9999
863	Q493315		1922 Bardu	Bardu	"Troms"	1922	1854	2020
1147	Q493315		5416 Bardu	Bardu	"Troms og Finnmark"	5416	2020	9999
318	Q493481		1004 Flekkefjord	Flekkefjord	"Vest-Agder"	1004	1838	2020
1074	Q493481		4207 Flekkefjord	Flekkefjord	"Agder"	4207	2020	9999
788	Q493758		1825 Grane	Grane	"Nordland"	1825	1927	9999
570	Q493762		1515 Herøy	Herøy	"Møre og Romsdal"	1515	1838	9999
513	Q493811		1401 Flora	Flora	"Sogn og Fjordane"	1401	1964	2020
739	Q493846		1736 Snåsa	Snåsa	"Nord-Trøndelag"	1736	1838	2018
927	Q493846		5041 Snåsa	Snåsa	"Trøndelag"	5041	2018	9999
818	Q493851		1850 Tysfjord	Tysfjord	"Nordland"	1850	1869	2020
781	Q493932		1818 Herøy	Herøy	"Nordland"	1818	1864	9999
478	Q493936		1243 Os	Os	"Hordaland"	1243	1838	2020
882	Q493942		1940 Kåfjord	Kåfjord	"Troms"	1940	1929	2020
1157	Q493942		5426 Kåfjord	Kåfjord	"Troms og Finnmark"	5426	2020	9999
571	Q493961		1516 Ulstein	Ulstein	"Møre og Romsdal"	1516	1838	9999
423	Q493977		1146 Tysvær	Tysvær	"Rogaland"	1146	1849	9999
393	Q493981		1121 Time	Time	"Rogaland"	1121	1838	9999
703	Q493988		1663 Malvik	Malvik	"Sør-Trøndelag"	1663	1891	2018
917	Q493988		5031 Malvik	Malvik	"Trøndelag"	5031	2018	9999
566	Q493992		1511 Vanylven	Vanylven	"Møre og Romsdal"	1511	1838	9999
745	Q493996		1740 Namsskogan	Namsskogan	"Nord-Trøndelag"	1740	1923	2018
930	Q493996		5044 Namsskogan	Namsskogan	"Trøndelag"	5044	2018	9999
743	Q493999		1738 Lierne	Lierne	"Nord-Trøndelag"	1738	1964	2018
928	Q493999		5042 Lierne	Lierne	"Trøndelag"	5042	2018	9999
816	Q494005		1848 Steigen	Steigen	"Nordland"	1848	1838	9999
605	Q4940094		1544 Bolsøy	Bolsøy	"Møre og Romsdal"	1544	1838	1964
580	Q494011		1524 Norddal	Norddal	"Møre og Romsdal"	1524	1838	2020
880	Q494018		1938 Lyngen	Lyngen	"Troms"	1938	1838	2020
1155	Q494018		5424 Lyngen	Lyngen	"Troms og Finnmark"	5424	2020	9999
421	Q494024		1144 Kvitsøy	Kvitsøy	"Rogaland"	1144	1923	9999
572	Q494029		1517 Hareid	Hareid	"Møre og Romsdal"	1517	1917	9999
516	Q494037		1413 Hyllestad	Hyllestad	"Sogn og Fjordane"	1413	1862	2020
1121	Q494037		4637 Hyllestad	Hyllestad	"Vestland"	4637	2020	9999
419	Q494045		1142 Rennesøy	Rennesøy	"Rogaland"	1142	1838	2020
553	Q494049		1444 Hornindal	Hornindal	"Sogn og Fjordane"	1444	1977	2020
705	Q494053		1665 Tydal	Tydal	"Sør-Trøndelag"	1665	1901	2018
919	Q494053		5033 Tydal	Tydal	"Trøndelag"	5033	2018	9999
884	Q494059		1942 Nordreisa	Nordreisa	"Troms"	1942	1886	2020
1159	Q494059		5428 Nordreisa	Nordreisa	"Troms og Finnmark"	5428	2020	9999
792	Q494062		1828 Nesna	Nesna	"Nordland"	1828	1838	9999
779	Q494068		1816 Vevelstad	Vevelstad	"Nordland"	1816	1916	9999
591	Q494670		1532 Giske	Giske	"Møre og Romsdal"	1532	1908	9999
828	Q494680		1859 Flakstad	Flakstad	"Nordland"	1859	1838	1964
829	Q494680		1859 Flakstad	Flakstad	"Nordland"	1859	1976	9999
755	Q494688		1748 Fosnes	Fosnes	"Nord-Trøndelag"	1748	1838	2018
934	Q494688		5048 Fosnes	Fosnes	"Trøndelag"	5048	2018	2020
217	Q4948756		0715 Botne	Botne	"Vestfold"	0715	1838	1964
692	Q4968489		1652 Flå	Flå	"Sør-Trøndelag"	1652	1880	1964
177	Q497248		0618 Hemsedal	Hemsedal	"Buskerud"	0618	1897	2020
986	Q497248		3042 Hemsedal	Hemsedal	"Viken"	3042	2020	9999
8	Q4973140		0112 Torsnes	Torsnes	"Østfold"	0112	1910	1964
543	Q4976983		1436 Bru	Bru	"Sogn og Fjordane"	1436	1923	1964
230	Q4979069		0726 Brunlanes	Brunlanes	"Vestfold"	0726	1838	1988
686	Q4984028		1647 Budal	Budal	"Sør-Trøndelag"	1647	1879	1964
306	Q4993005		0936 Hornnes	Hornnes	"Aust-Agder"	0936	1886	1960
310	Q4993361		0939 Hylestad	Hylestad	"Aust-Agder"	0939	1915	1962
536	Q499397		1429 Fjaler	Fjaler	"Sogn og Fjordane"	1429	1838	2020
1130	Q499397		4646 Fjaler	Fjaler	"Vestland"	4646	2020	9999
198	Q4994284		0681 Strømsgodset	Strømsgodset	"Buskerud"	0681	1838	1843
633	Q499429		1569 Aure	Aure	"Møre og Romsdal"	1569	1838	2006
641	Q499429		1576 Aure	Aure	"Møre og Romsdal"	1576	2006	9999
34	Q499446		0137 Våler	Våler	"Østfold"	0137	1838	2020
962	Q499446		3018 Våler	Våler	"Viken"	3018	2020	9999
254	Q499450		0821 Bø	Bø	"Telemark"	0821	1838	2020
545	Q499455		1438 Bremanger	Bremanger	"Sogn og Fjordane"	1438	1866	2020
1132	Q499455		4648 Bremanger	Bremanger	"Vestland"	4648	2020	9999
430	Q499485		1151 Utsira	Utsira	"Rogaland"	1151	1924	9999
220	Q499570		0716 Re	Re	"Vestfold"	0716	2002	2020
593	Q499575		1534 Haram	Haram	"Møre og Romsdal"	1534	1838	2020
726	Q499704		1723 Mosvik	Mosvik	"Nord-Trøndelag"	1723	1901	2012
620	Q499711		1556 Frei	Frei	"Møre og Romsdal"	1556	1838	2008
547	Q499719		1439 Vågsøy	Vågsøy	"Sogn og Fjordane"	1439	1964	2020
749	Q499761		1744 Overhalla	Overhalla	"Nord-Trøndelag"	1744	1838	2018
933	Q499761		5047 Overhalla	Overhalla	"Trøndelag"	5047	2018	9999
873	Q499770		1931 Lenvik	Lenvik	"Troms"	1931	1838	2020
727	Q499779		1724 Verran	Verran	"Nord-Trøndelag"	1724	1901	2018
925	Q499779		5039 Verran	Verran	"Trøndelag"	5039	2018	2020
216	Q499786		0714 Hof	Hof	"Vestfold"	0714	1838	2018
344	Q499842		1027 Audnedal	Audnedal	"Vest-Agder"	1027	1964	2020
872	Q4999463		1930 Hillesøy	Hillesøy	"Troms"	1930	1855	1964
697	Q500186		1657 Skaun	Skaun	"Sør-Trøndelag"	1657	1890	2018
915	Q500186		5029 Skaun	Skaun	"Trøndelag"	5029	2018	9999
862	Q500194		1921 Salangen	Salangen	"Troms"	1921	1871	1977
865	Q500194		1923 Salangen	Salangen	"Troms"	1923	1977	2020
1148	Q500194		5417 Salangen	Salangen	"Troms og Finnmark"	5417	2020	9999
551	Q500198		1443 Eid	Eid	"Sogn og Fjordane"	1443	1838	2020
600	Q500205		1539 Rauma	Rauma	"Møre og Romsdal"	1539	1964	9999
392	Q500223		1120 Klepp	Klepp	"Rogaland"	1120	1838	9999
322	Q500227		1014 Vennesla	Vennesla	"Vest-Agder"	1014	1865	2020
1087	Q500227		4223 Vennesla	Vennesla	"Agder"	4223	2020	9999
471	Q5002472		1236 Vossestrand	Vossestrand	"Hordaland"	1236	1868	1964
676	Q500284		1638 Orkdal	Orkdal	"Sør-Trøndelag"	1638	1838	2018
1193	Q500284		5024 Orkdal	Orkdal	"Trøndelag"	5024	2018	2020
232	Q500290		0728 Lardal	Lardal	"Vestfold"	0728	1838	2018
329	Q501401		1018 Søgne	Søgne	"Vest-Agder"	1018	1838	2020
97	Q501413		0426 Våler	Våler	"Hedmark"	0426	1854	2020
1011	Q501413		3419 Våler	Våler	"Innlandet"	3419	2020	9999
569	Q501510		1514 Sande	Sande	"Møre og Romsdal"	1514	1867	9999
148	Q501518		0534 Gran	Gran	"Oppland"	0534	1838	2020
1036	Q501518		3446 Gran	Gran	"Innlandet"	3446	2020	9999
728	Q502193		1725 Namdalseid	Namdalseid	"Nord-Trøndelag"	1725	1904	2018
926	Q502193		5040 Namdalseid	Namdalseid	"Trøndelag"	5040	2018	2020
434	Q502197		1154 Vindafjord	Vindafjord	"Rogaland"	1154	1965	2006
440	Q502197		1160 Vindafjord	Vindafjord	"Rogaland"	1160	2006	9999
861	Q502217		1920 Lavangen	Lavangen	"Troms"	1920	1977	2020
1146	Q502217		5415 Lavangen	Lavangen	"Troms og Finnmark"	5415	2020	9999
763	Q503591		1755 Leka	Leka	"Nord-Trøndelag"	1755	1860	2018
938	Q503591		5052 Leka	Leka	"Trøndelag"	5052	2018	9999
1188	Q503600		5019 Roan	Roan	"Trøndelag"	5019	2018	2020
670	Q503600		1632 Roan	Roan	"Sør-Trøndelag"	1632	1892	2018
533	Q503612		1426 Luster	Luster	"Sogn og Fjordane"	1426	1838	2020
1128	Q503612		4644 Luster	Luster	"Vestland"	4644	2020	9999
540	Q503622		1433 Naustdal	Naustdal	"Sogn og Fjordane"	1433	1896	2020
161	Q503637		0545 Vang	Vang	"Oppland"	0545	1838	2020
1044	Q503637		3454 Vang	Vang	"Innlandet"	3454	2020	9999
787	Q503654		1824 Vefsn	Vefsn	"Nordland"	1824	1838	9999
723	Q503660		1721 Verdal	Verdal	"Nord-Trøndelag"	1721	1838	2018
924	Q503660		5038 Verdal	Verdal	"Trøndelag"	5038	2018	9999
871	Q503912		1929 Berg	Berg	"Troms"	1929	1838	2020
535	Q504817		1428 Askvoll	Askvoll	"Sogn og Fjordane"	1428	1838	2020
1129	Q504817		4645 Askvoll	Askvoll	"Vestland"	4645	2020	9999
350	Q505952		1032 Lyngdal	Lyngdal	"Vest-Agder"	1032	1838	2020
1089	Q505952		4225 Lyngdal	Lyngdal	"Agder"	4225	2020	9999
328	Q505956		1017 Songdalen	Songdalen	"Vest-Agder"	1017	1964	2020
831	Q507201		1860 Vestvågøy	Vestvågøy	"Nordland"	1860	1963	9999
126	Q507499		0517 Sel	Sel	"Oppland"	0517	1908	2020
1029	Q507499		3437 Sel	Sel	"Innlandet"	3437	2020	9999
480	Q507509		1245 Sund	Sund	"Hordaland"	1245	1838	2020
590	Q507524		1531 Sula	Sula	"Møre og Romsdal"	1531	1977	9999
111	Q507549		0436 Tolga	Tolga	"Hedmark"	0436	1976	2020
1018	Q507549		3426 Tolga	Tolga	"Innlandet"	3426	2020	9999
1022	Q507562		3430 Os	Os	"Innlandet"	3430	2020	9999
713	Q50902988		1714 Størdalen	Størdalen	"Nord-Trøndelag"	1714	1838	1850
711	Q51060319		1712 Hegra	Hegra	"Nord-Trøndelag"	1712	1874	1962
716	Q51060859		1715 Skatval	Skatval	"Nord-Trøndelag"	1715	1902	1962
717	Q51242648		1716 Åsen	Åsen	"Nord-Trøndelag"	1716	1838	1962
720	Q51242990		1719 Skogn	Skogn	"Nord-Trøndelag"	1719	1838	1962
382	Q515536		1112 Lund	Lund	"Rogaland"	1112	1838	9999
730	Q51609514		1727 Beitstad	Beitstad	"Nord-Trøndelag"	1727	1838	1964
734	Q51609766		1731 Sparbu	Sparbu	"Nord-Trøndelag"	1731	1838	1964
733	Q51844626		1730 Røra	Røra	"Nord-Trøndelag"	1730	1907	1962
617	Q51986536		1554 Bremsnes	Bremsnes	"Møre og Romsdal"	1554	1897	1964
753	Q52032912		1746 Klinga	Klinga	"Nord-Trøndelag"	1746	1891	1964
746	Q52153290		1741 Harran	Harran	"Nord-Trøndelag"	1741	1923	1964
557	Q5223		1448 Stryn	Stryn	"Sogn og Fjordane"	1448	1843	1977
558	Q5223		1449 Stryn	Stryn	"Sogn og Fjordane"	1449	1977	2020
1135	Q5223		4651 Stryn	Stryn	"Vestland"	4651	2020	9999
761	Q52292813		1753 Foldereid	Foldereid	"Nord-Trøndelag"	1753	1886	1964
762	Q52367438		1754 Gravvik	Gravvik	"Nord-Trøndelag"	1754	1909	1964
760	Q52367652		1752 Kolvereid	Kolvereid	"Nord-Trøndelag"	1752	1886	1964
946	Q52368284		5060 Nærøysund	Nærøysund	"Trøndelag"	5060	2020	9999
550	Q5241765		1442 Davik	Davik	"Sogn og Fjordane"	1442	1838	1965
74	Q5245991		0301	Oslo	"Oslo"	0301	1050	9999
700	Q5278345		1660 Strinda	Strinda	"Sør-Trøndelag"	1660	1838	1964
83	Q5282173		0414 Vang	Vang	"Hedmark"	0414	1838	1992
856	Q528350		1916 Andørja	Andørja	"Troms"	1916	1926	1964
281	Q5319300		0915 Dypvåg	Dypvåg	"Aust-Agder"	0915	1838	1960
736	Q5347875		1733 Egge	Egge	"Nord-Trøndelag"	1733	1869	1964
596	Q5348774		1537 Eid og Vold	Eid og Vold	"Møre og Romsdal"	1537	1838	1874
292	Q5348778		0925 Eide	Eide	"Aust-Agder"	0925	1838	1962
542	Q5349243		1435 Eikefjord	Eikefjord	"Sogn og Fjordane"	1435	1923	1964
353	Q5349246		1035 Eiken	Eiken	"Vest-Agder"	1035	1916	1963
183	Q5349258		0624 Eker	Eker	"Buskerud"	0624	1838	1885
45	Q54062		0214 Ås	Ås	"Akershus"	0214	1838	2020
965	Q54062		3021 Ås	Ås	"Viken"	3021	2020	9999
472	Q5415850		1237 Evanger	Evanger	"Hordaland"	1237	1885	1964
302	Q5418522		0934 Evje og Veigusdal	Evje og Veigusdal	"Aust-Agder"	0934	1838	1877
484	Q5433609		1249 Fana	Fana	"Hordaland"	1249	1838	1972
290	Q5456512		0923 Fjære	Fjære	"Aust-Agder"	0923	1846	1971
282	Q5461995		0916 Flosta	Flosta	"Aust-Agder"	0916	1902	1962
224	Q5499099		0720 Stokke	Stokke	"Vestfold"	0720	1838	2017
722	Q5505338		1720 Frol	Frol	"Nord-Trøndelag"	1720	1855	1962
129	Q5505754		0518 Fron	Fron	"Oppland"	0518	1966	1977
699	Q5530263		1659 Geitastrand	Geitastrand	"Sør-Trøndelag"	1659	1905	1963
298	Q5566064		0930 Gjøvdal	Gjøvdal	"Aust-Agder"	0930	1908	1960
29	Q5567538		0132 Glemmen	Glemmen	"Østfold"	0132	1838	1964
327	Q5607328		1017 Greipstad	Greipstad	"Vest-Agder"	1017	1913	1964
339	Q5609439		1025 Grindheim	Grindheim	"Vest-Agder"	1025	1902	1964
636	Q56243583		1572 Tustna	Tustna	"Møre og Romsdal"	1572	1874	2006
1152	Q56249968		5421 Senja	Senja	"Troms og Finnmark"	5421	2020	9999
196	Q56404164		0634 Uvdal	Uvdal	"Buskerud"	0634	1901	1962
1115	Q56404228		4631 Alver	Alver	"Vestland"	4631	2020	9999
1059	Q56405258		3817 Midt-Telemark	Midt-Telemark	"Vestfold og Telemark"	3817	2020	9999
1094	Q56405940		4602 Kinn	Kinn	"Vestland"	4602	2020	9999
1131	Q56406057		4647 Sunnfjord	Sunnfjord	"Vestland"	4647	2020	9999
330	Q5643524		1019 Halse og Harkmark	Halse og Harkmark	"Vest-Agder"	1019	1838	1964
845	Q56502360		1873 Andenes	Andenes	"Nordland"	1873	1924	1964
844	Q56530876		1872 Dverberg	Dverberg	"Nordland"	1872	1838	1964
842	Q56564062		1871 Bjørnskinn	Bjørnskinn	"Nordland"	1871	1924	1964
810	Q56636775		1844 Kjerringøy	Kjerringøy	"Nordland"	1844	1906	1964
808	Q56642044		1842 Skjerstad	Skjerstad	"Nordland"	1842	1838	2005
794	Q56650621		1830 Korgen	Korgen	"Nordland"	1830	1918	1964
793	Q56655130		1829 Elsfjord	Elsfjord	"Nordland"	1829	1929	1962
780	Q56679151		1817 Tjøtta	Tjøtta	"Nordland"	1817	1862	1965
784	Q56698052		1821 Sandnessjøen	Sandnessjøen	"Nordland"	1821	1899	1965
307	Q56774779		0937 Evje	Evje	"Aust-Agder"	0937	1877	1960
303	Q56775345		0934 Vegusdal	Vegusdal	"Aust-Agder"	0934	1877	1967
324	Q56776609		1016 Øvrebø	Øvrebø	"Vest-Agder"	1016	1838	1865
485	Q5682802		1250 Haus	Haus	"Hordaland"	1250	1838	1964
51	Q56869		0220 Asker	Asker	"Akershus"	0220	1838	2020
54	Q56915		0221 Aurskog-Høland	Aurskog-Høland	"Akershus"	0221	1966	2020
970	Q56915		3026 Aurskog-Høland	Aurskog-Høland	"Viken"	3026	2020	9999
231	Q5697671		0727 Hedrum	Hedrum	"Vestfold"	0727	1838	1988
50	Q57076		0219 Bærum	Bærum	"Akershus"	0219	1838	2020
968	Q57076		3024 Bærum	Bærum	"Viken"	3024	2020	9999
70	Q57080		0237 Eidsvoll	Eidsvoll	"Akershus"	0237	1838	2020
979	Q57080		3035 Eidsvoll	Eidsvoll	"Viken"	3035	2020	9999
62	Q57081		0229 Enebakk	Enebakk	"Akershus"	0229	1838	2020
972	Q57081		3028 Enebakk	Enebakk	"Viken"	3028	2020	9999
60	Q57082		0227 Fet	Fet	"Akershus"	0227	1838	2020
46	Q57083		0215 Frogn	Frogn	"Akershus"	0215	1838	2020
966	Q57083		3022 Frogn	Frogn	"Viken"	3022	2020	9999
67	Q57084		0234 Gjerdrum	Gjerdrum	"Akershus"	0234	1838	2020
976	Q57084		3032 Gjerdrum	Gjerdrum	"Viken"	3032	2020	9999
601	Q5712904		1540 Hen	Hen	"Møre og Romsdal"	1540	1902	1964
72	Q57858		0239 Hurdal	Hurdal	"Akershus"	0239	1838	2020
981	Q57858		3037 Hurdal	Hurdal	"Viken"	3037	2020	9999
63	Q57860		0230 Lørenskog	Lørenskog	"Akershus"	0230	1908	2020
973	Q57860		3029 Lørenskog	Lørenskog	"Viken"	3029	2020	9999
71	Q57862		0238 Nannestad	Nannestad	"Akershus"	0238	1838	2020
980	Q57862		3036 Nannestad	Nannestad	"Viken"	3036	2020	9999
47	Q57864		0216 Nesodden	Nesodden	"Akershus"	0216	1838	2020
967	Q57864		3023 Nesodden	Nesodden	"Viken"	3023	2020	9999
66	Q57865		0233 Nittedal	Nittedal	"Akershus"	0233	1838	2020
975	Q57865		3031 Nittedal	Nittedal	"Viken"	3031	2020	9999
48	Q57868		0217 Oppegård	Oppegård	"Akershus"	0217	1915	2020
61	Q57870		0228 Rælingen	Rælingen	"Akershus"	0228	1929	2020
971	Q57870		3027 Rælingen	Rælingen	"Viken"	3027	2020	9999
64	Q57871		0231 Skedsmo	Skedsmo	"Akershus"	0231	1838	2020
44	Q57912		0213 Ski	Ski	"Akershus"	0213	1931	2020
59	Q57914		0226 Sørum	Sørum	"Akershus"	0226	1838	2020
68	Q57917		0235 Ullensaker	Ullensaker	"Akershus"	0235	1838	2020
977	Q57917		3033 Ullensaker	Ullensaker	"Viken"	3033	2020	9999
42	Q57918		0211 Vestby	Vestby	"Akershus"	0211	1838	2020
963	Q57918		3019 Vestby	Vestby	"Viken"	3019	2020	9999
272	Q57919		0903 Arendal	Arendal	"Aust-Agder"	0903	1838	1992
275	Q57919		0906 Arendal	Arendal	"Aust-Agder"	0906	1992	2020
1070	Q57919		4203 Arendal	Arendal	"Agder"	4203	2020	9999
497	Q5873236		1259 Hjelme	Hjelme	"Hordaland"	1259	1910	1964
577	Q5873359		1522 Hjørundfjord	Hjørundfjord	"Møre og Romsdal"	1522	1838	1964
474	Q5963533		1239 Hålandsdal	Hålandsdal	"Hordaland"	1239	1903	1964
52	Q5964829		0221 Høland	Høland	"Akershus"	0221	1838	1924
194	Q5981735		0633 Nore	Nore	"Buskerud"	0633	1858	1962
1108	Q60742846		4624 Bjørnafjorden	Bjørnafjorden	"Vestland"	4624	2020	9999
644	Q60777023		1579 Hustadvika	Hustadvika	"Møre og Romsdal"	1579	2020	9999
974	Q60806432		3030 Lillestrøm	Lillestrøm	"Viken"	3030	2020	9999
1133	Q61015259		4649 Stad	Stad	"Vestland"	4649	2020	9999
348	Q61954914		1030 Spangereid	Spangereid	"Vest-Agder"	1030	1899	1964
360	Q61955092		1040 Spind	Spind	"Vest-Agder"	1040	1893	1965
367	Q61955227		1046 Siredalen	Siredalen	"Vest-Agder"	1046	1849	1905
288	Q62007094		0921 Tromøy	Tromøy	"Aust-Agder"	0921	1878	1992
289	Q62007154		0922 Hisøy	Hisøy	"Aust-Agder"	0922	1881	1992
314	Q62007203		0990 Barbu	Barbu	"Aust-Agder"	0990	1878	1902
848	Q62140		1901 Harstad	Harstad	"Troms"	1901	1904	2013
850	Q62140		1903 Harstad	Harstad	"Troms"	1903	2013	2020
1137	Q62140		5402 Harstad	Harstad	"Troms og Finnmark"	5402	2020	9999
559	Q62266		1501 Ålesund	Ålesund	"Møre og Romsdal"	1501	1838	1977
562	Q62266		1504 Ålesund	Ålesund	"Møre og Romsdal"	1504	1977	2020
565	Q62266		1507 Ålesund	Ålesund	"Møre og Romsdal"	1507	2020	9999
899	Q62641		2019 Nordkapp	Nordkapp	"Finnmark"	2019	1861	2020
1165	Q62641		5435 Nordkapp	Nordkapp	"Troms og Finnmark"	5435	2020	9999
640	Q62932198		1575 Hopen	Hopen	"Møre og Romsdal"	1575	1915	1960
632	Q63002977		1568 Stemshaug	Stemshaug	"Møre og Romsdal"	1568	1914	1965
487	Q63087987		1251 Bruvik	Bruvik	"Hordaland"	1251	1870	1964
629	Q63088008		1565 Åsskard	Åsskard	"Møre og Romsdal"	1565	1895	1965
10	Q63116103		0114 Varteig	Varteig	"Østfold"	0114	1861	1992
23	Q63116214		0126 Mysen	Mysen	"Østfold"	0126	1920	1961
26	Q63116247		0129 Degernes	Degernes	"Østfold"	0129	1917	1964
28	Q63116329		0131 Rolvsøy	Rolvsøy	"Østfold"	0131	1911	1994
30	Q63116379		0133 Kråkerøy	Kråkerøy	"Østfold"	0133	1908	1994
31	Q63116427		0134 Onsøy	Onsøy	"Østfold"	0134	1838	1994
38	Q63116687		0201 Son	Son	"Akershus"	0201	1847	1964
41	Q63116697		0204 Hølen	Hølen	"Akershus"	0204	1847	1943
43	Q63116824		0212 Kråkstad	Kråkstad	"Akershus"	0212	1838	1964
40	Q63116857		0203 Drøbak	Drøbak	"Akershus"	0203	1838	1962
56	Q63116922		0223 Setskog	Setskog	"Akershus"	0223	1905	1966
57	Q63116947		0224 Aurskog	Aurskog	"Akershus"	0224	1838	1966
58	Q63116973		0225 Blaker	Blaker	"Akershus"	0225	1919	1962
73	Q63117028		0240 Feiring	Feiring	"Akershus"	0240	1870	1964
80	Q63117499		0411 Nes	Nes	"Hedmark"	0411	1838	1964
82	Q63117533		0413 Furnes	Furnes	"Hedmark"	0413	1893	1964
85	Q63117623		0416 Romedal	Romedal	"Hedmark"	0416	1838	1964
90	Q63117730		0421 Vinger	Vinger	"Hedmark"	0421	1838	1964
92	Q63117749		0422 Brandval	Brandval	"Hedmark"	0422	1867	1964
94	Q63117808		0424 Hof	Hof	"Hedmark"	0424	1838	1963
115	Q63118108		0440 Kvikne	Kvikne	"Hedmark"	0440	1838	1966
134	Q63118404		0522 Gausdal	Gausdal	"Oppland"	0522	1838	1879
144	Q63118587		0530 Eina	Eina	"Oppland"	0530	1908	1964
145	Q63118617		0531 Kolbu	Kolbu	"Oppland"	0531	1908	1964
149	Q63118667		0535 Brandbu	Brandbu	"Oppland"	0535	1897	1962
150	Q63118689		0536 Land	Land	"Oppland"	0536	1838	1847
152	Q63118716		0537 Fluberg	Fluberg	"Oppland"	0537	1914	1962
158	Q63118746		0543 Slidre	Slidre	"Oppland"	0543	1838	1849
169	Q63121688		0611 Tyristrand	Tyristrand	"Buskerud"	0611	1916	1964
170	Q63121746		0612 Hole	Hole	"Buskerud"	0612	1838	1964
163	Q63121877		0601 Hønefoss	Hønefoss	"Buskerud"	0601	1852	1964
213	Q63123302		0712 Skoger	Skoger	"Vestfold"	0712	1838	1964
222	Q63123608		0718 Ramnes	Ramnes	"Vestfold"	0718	1838	2002
221	Q63123672		0717 Borre	Borre	"Vestfold"	0717	1838	1988
203	Q63123952		0704 Åsgårdstrand	Åsgårdstrand	"Vestfold"	0704	1838	1965
208	Q63124142		0708 Stavern	Stavern	"Vestfold"	0708	1942	1988
234	Q63124142		0798 Stavern	Stavern	"Vestfold"	0798	1838	1942
244	Q63167010		0813 Eidanger	Eidanger	"Telemark"	0813	1838	1964
238	Q63167040		0804 Brevik	Brevik	"Telemark"	0804	1838	1964
236	Q63167073		0802 Langesund	Langesund	"Telemark"	0802	1838	1964
237	Q63167091		0803 Stathelle	Stathelle	"Telemark"	0803	1838	1964
246	Q63167112		0815 Skåtøy	Skåtøy	"Telemark"	0815	1883	1960
253	Q63167162		0820 Lunde	Lunde	"Telemark"	0820	1867	1964
256	Q63167197		0823 Heddal	Heddal	"Telemark"	0823	1838	1964
257	Q63167225		0824 Gransherad	Gransherad	"Telemark"	0824	1860	1964
258	Q63167289		0825 Hovin	Hovin	"Telemark"	0825	1886	1964
371	Q63167427		1101 Egersund	Egersund	"Rogaland"	1101	1838	1965
389	Q63167479		1119 Hå	Hå	"Rogaland"	1119	1838	1894
396	Q63167558		1123 Høyland	Høyland	"Rogaland"	1123	1838	1965
403	Q63167594		1128 Høle	Høle	"Rogaland"	1128	1871	1965
420	Q63167921		1143 Mosterøy	Mosterøy	"Rogaland"	1143	1884	1965
377	Q63168009		1105 Kopervik	Kopervik	"Rogaland"	1105	1866	1965
376	Q63168038		1104 Skudeneshavn	Skudeneshavn	"Rogaland"	1104	1858	1965
431	Q63168065		1152 Torvastad	Torvastad	"Rogaland"	1152	1838	1965
628	Q63170679		1564 Stangvik	Stangvik	"Møre og Romsdal"	1564	1838	1965
666	Q6321667		1629 Jøssund	Jøssund	"Sør-Trøndelag"	1629	1896	1964
1110	Q63644915		4626 Øygarden	Øygarden	"Vestland"	4626	2020	9999
619	Q63959144		1555 Grip	Grip	"Møre og Romsdal"	1555	1897	1964
616	Q64024507		1553 Kvernes	Kvernes	"Møre og Romsdal"	1553	1838	1964
622	Q64088974		1558 Øre	Øre	"Møre og Romsdal"	1558	1838	1965
544	Q6414011		1437 Kinn	Kinn	"Sogn og Fjordane"	1437	1838	1964
444	Q64153949		1213 Fjelberg	Fjelberg	"Hordaland"	1213	1838	1965
613	Q64224717		1550 Hustad	Hustad	"Møre og Romsdal"	1550	1918	1964
612	Q64224830		1549 Bud	Bud	"Møre og Romsdal"	1549	1838	1964
738	Q6449608		1735 Kvam	Kvam	"Nord-Trøndelag"	1735	1909	1964
556	Q64517419		1447 Innvik	Innvik	"Sogn og Fjordane"	1447	1838	1965
890	Q6459		2011 Kautokeino	Kautokeino	"Finnmark"	2011	1851	2020
1161	Q6459		5430 Kautokeino	Kautokeino	"Troms og Finnmark"	5430	2020	9999
496	Q64785883		1258 Herdla	Herdla	"Hordaland"	1258	1871	1964
483	Q6479792		1248 Laksevåg	Laksevåg	"Hordaland"	1248	1918	1972
291	Q6485272		0924 Landvik	Landvik	"Aust-Agder"	0924	1838	1971
851	Q649541		1911 Kvæfjord	Kvæfjord	"Troms"	1911	1838	2020
1142	Q649541		5411 Kvæfjord	Kvæfjord	"Troms og Finnmark"	5411	2020	9999
665	Q6513900		1628 Nes	Nes	"Sør-Trøndelag"	1628	1899	1964
248	Q6513993		0816 Sannidal	Sannidal	"Telemark"	0816	1838	1960
250	Q6514293		0818 Solum	Solum	"Telemark"	0818	1838	1964
546	Q6514340		1439 Sør-Vågsøy	Sør-Vågsøy	"Sogn og Fjordane"	1439	1910	1964
578	Q6514366		1523 Sunnylven	Sunnylven	"Møre og Romsdal"	1523	1838	1965
663	Q6514377		1626 Stjørna	Stjørna	"Sør-Trøndelag"	1626	1899	1964
602	Q6514386		1541 Veøy	Veøy	"Møre og Romsdal"	1541	1838	1964
662	Q6514479		1625 Stadsbygd	Stadsbygd	"Sør-Trøndelag"	1625	1838	1964
135	Q6514568		0522 Østre Gausdal	Østre Gausdal	"Oppland"	0522	1879	1962
189	Q6514591		0629 Sandsvær	Sandsvær	"Buskerud"	0629	1838	1908
576	Q6514626		1521 Vartdal	Vartdal	"Møre og Romsdal"	1521	1895	1964
548	Q6514672		1440 Nord-Vågsøy	Nord-Vågsøy	"Sogn og Fjordane"	1440	1910	1964
459	Q6514698		1226 Strandebarm	Strandebarm	"Hordaland"	1226	1902	1965
623	Q6514754		1559 Straumsnes	Straumsnes	"Møre og Romsdal"	1559	1866	1964
190	Q6514849		0629 Ytre Sandsvær	Ytre Sandsvær	"Buskerud"	0629	1908	1964
429	Q6514892		1150 Skudenes	Skudenes	"Rogaland"	1150	1838	1965
646	Q6514912		1611 Vinje	Vinje	"Sør-Trøndelag"	1611	1924	1964
742	Q6515113		1738 Nordli	Nordli	"Nord-Trøndelag"	1738	1915	1964
211	Q6515155		0711 Strømm	Strømm	"Vestfold"	0711	1838	1964
197	Q6515155		0680 Strømmen	Strømmen	"Buskerud"	0680	1838	1838
568	Q6515228		1513 Rovde	Rovde	"Møre og Romsdal"	1513	1905	1964
15	Q6515246		0119 Øymark	Øymark	"Østfold"	0119	1903	1964
106	Q6515253		0433 Øvre Rendal	Øvre Rendal	"Hedmark"	0433	1880	1965
141	Q6515516		0527 Vardal	Vardal	"Oppland"	0527	1838	1964
741	Q6515529		1737 Sørli	Sørli	"Nord-Trøndelag"	1737	1915	1964
293	Q6515556		0926 Vestre Moland	Vestre Moland	"Aust-Agder"	0926	1838	1962
649	Q6515569		1614 Heim	Heim	"Sør-Trøndelag"	1614	1911	1964
426	Q6515601		1148 Stangaland	Stangaland	"Rogaland"	1148	1909	1965
731	Q6515612		1728 Sandvollan	Sandvollan	"Nord-Trøndelag"	1728	1907	1962
607	Q6515740		1545 Sør-Aukra	Sør-Aukra	"Møre og Romsdal"	1545	1924	1965
567	Q6515749		1512 Syvde	Syvde	"Møre og Romsdal"	1512	1918	1964
910	Q6515760		2029 Nord-Varanger	Nord-Varanger	"Finnmark"	2029	1838	1964
359	Q6515958		1039 Herad	Herad	"Vest-Agder"	1039	1838	1965
712	Q6516141		1713 Lånke	Lånke	"Nord-Trøndelag"	1713	1902	1962
896	Q6516183		2016 Sørøysund	Sørøysund	"Finnmark"	2016	1838	1992
364	Q6516279		1043 Nes	Nes	"Vest-Agder"	1043	1893	1965
299	Q6516290		0931 Tovdal	Tovdal	"Aust-Agder"	0931	1908	1967
173	Q6516332		0614 Ådal	Ådal	"Buskerud"	0614	1857	1964
370	Q6516567		1047 Øvre Sirdal	Øvre Sirdal	"Vest-Agder"	1047	1905	1960
285	Q6516575		0918 Moland	Moland	"Aust-Agder"	0918	1962	1992
287	Q6516658		0920 Øyestad	Øyestad	"Aust-Agder"	0920	1838	1992
397	Q6517042		1124 Håland	Håland	"Rogaland"	1124	1838	1930
363	Q6517047		1042 Hidra	Hidra	"Vest-Agder"	1042	1893	1965
140	Q6517387		0526 Snertingdal	Snertingdal	"Oppland"	0526	1910	1964
876	Q6517425		1934 Tromsøysund	Tromsøysund	"Troms"	1934	1838	1964
643	Q65230514		1578 Fjord	Fjord	"Møre og Romsdal"	1578	2020	9999
892	Q6535		2012 Alta	Alta	"Finnmark"	2012	1863	2020
1138	Q6535		5403 Alta	Alta	"Troms og Finnmark"	5403	2020	9999
448	Q66087397		1217 Valestrand	Valestrand	"Hordaland"	1217	1868	1964
452	Q66087599		1220 Bremnes	Bremnes	"Hordaland"	1220	1916	1963
466	Q66087720		1232 Eidfjord	Eidfjord	"Hordaland"	1232	1891	1964
517	Q66087990		1414 Brække	Brække	"Sogn og Fjordane"	1414	1850	1861
519	Q66088014		1415 Ladvik	Ladvik	"Sogn og Fjordane"	1415	1838	1861
522	Q66088022		1416 Kyrkjebø	Kyrkjebø	"Sogn og Fjordane"	1416	1858	1964
530	Q66088042		1423 Borgund	Borgund	"Sogn og Fjordane"	1423	1864	1964
532	Q66088051		1425 Hafslo	Hafslo	"Sogn og Fjordane"	1425	1838	1963
512	Q66088093		1401 Florø	Florø	"Sogn og Fjordane"	1401	1861	1964
552	Q66088118		1444 Hornindal	Hornindal	"Sogn og Fjordane"	1444	1867	1965
725	Q6917045		1723 Mosviken og Verran	Mosviken og Verran	"Nord-Trøndelag"	1723	1867	1901
752	Q6976911		1745 Vemundvik	Vemundvik	"Nord-Trøndelag"	1745	1891	1964
626	Q6977154		1562 Ålvundeid	Ålvundeid	"Møre og Romsdal"	1562	1899	1960
104	Q6979070		0432 Ytre Rendal	Ytre Rendal	"Hedmark"	0432	1880	1965
675	Q6979399		1637 Orkland	Orkland	"Sør-Trøndelag"	1637	1920	1963
625	Q6980442		1561 Øksendal	Øksendal	"Møre og Romsdal"	1561	1854	1960
417	Q6981801		1140 Sjernarøy	Sjernarøy	"Rogaland"	1140	1868	1965
229	Q7018935		0725 Tjølling	Tjølling	"Vestfold"	0725	1838	1988
342	Q7050506	Annen skrivemåte i wikidata	1027 Nordre Undal	Nordre Undal	"Vest-Agder"	1027	1845	1911
656	Q7050515		1620 Nord-Frøya	Nord-Frøya	"Sør-Trøndelag"	1620	1906	1964
754	Q7109465		1747 Otterøy	Otterøy	"Nord-Trøndelag"	1747	1913	1964
17	Q7386714		0120 Rødenes	Rødenes	"Østfold"	0120	1838	1964
679	Q7386728		1641 Røros landsogn	Røros landsogn	"Sør-Trøndelag"	1641	1926	1964
102	Q7558366		0431 Sollia	Sollia	"Hedmark"	0431	1890	1965
162	Q7558366		0580 Sollien	Sollien	"Oppland"	0580	1864	1890
283	Q7618579		0917 Stokken	Stokken	"Aust-Agder"	0917	1919	1962
53	Q7666494		0221 Søndre Høland	Søndre Høland	"Akershus"	0221	1924	1966
346	Q7666501		1029 Sør-Audnedal	Sør-Audnedal	"Vest-Agder"	1029	1845	1964
655	Q7666505		1619 Sør-Frøya	Sør-Frøya	"Sør-Trøndelag"	1619	1906	1964
677	Q77656831		1639 Orkanger	Orkanger	"Sør-Trøndelag"	1639	1920	1963
109	Q7814241		0435 Tolga-Os	Tolga-Os	"Hedmark"	0435	1966	1976
766	Q78158799		1802 Mosjøen	Mosjøen	"Nordland"	1802	1875	1962
154	Q7826715		0539 Torpa	Torpa	"Oppland"	0539	1914	1962
27	Q7852920		0130 Tune	Tune	"Østfold"	0130	1838	1992
341	Q7882969		1027 Undal	Undal	"Vest-Agder"	1027	1838	1845
137	Q7923499		0523 Vestre Gausdal	Vestre Gausdal	"Oppland"	0523	1879	1962
765	Q79835953		1801 Brønnøysund	Brønnøysund	"Nordland"	1801	1923	1964
1072	Q80571266		4205 Lindesnes	Lindesnes	"Agder"	4205	2020	9999
969	Q80593157		3025 Asker	Asker	"Viken"	3025	2020	9999
1102	Q80678654		4618 Ullensvang	Ullensvang	"Vestland"	4618	2020	9999
508	Q8077202		1280 Aarstad	Aarstad	"Hordaland"	1280	1838	1915
95	Q8077265		0425 Aasnæs og Vaaler	Aasnæs og Vaaler	"Hedmark"	0425	1849	1854
325	Q8079292		1016 Øvrebø og Hægeland	Øvrebø og Hægeland	"Vest-Agder"	1016	1865	1896
332	Q8079310		1021 Øislebø og Laudal	Øislebø og Laudal	"Vest-Agder"	1021	1838	1899
296	Q88802		0928 Birkenes	Birkenes	"Aust-Agder"	0928	1838	2020
1080	Q88802		4216 Birkenes	Birkenes	"Agder"	4216	2020	9999
309	Q88804		0938 Bygland	Bygland	"Aust-Agder"	0938	1838	2020
1084	Q88804		4220 Bygland	Bygland	"Agder"	4220	2020	9999
312	Q88806		0941 Bykle	Bykle	"Aust-Agder"	0941	1902	2020
1086	Q88806		4222 Bykle	Bykle	"Agder"	4222	2020	9999
308	Q88808		0937 Evje og Hornnes	Evje og Hornnes	"Aust-Agder"	0937	1960	2020
1083	Q88808		4219 Evje og Hornnes	Evje og Hornnes	"Agder"	4219	2020	9999
286	Q88810		0919 Froland	Froland	"Aust-Agder"	0919	1850	2020
1078	Q88810		4214 Froland	Froland	"Agder"	4214	2020	9999
276	Q88813		0911 Gjerstad	Gjerstad	"Aust-Agder"	0911	1838	2020
1075	Q88813		4211 Gjerstad	Gjerstad	"Agder"	4211	2020	9999
273	Q90590		0904 Grimstad	Grimstad	"Aust-Agder"	0904	1838	2020
1069	Q90590		4202 Grimstad	Grimstad	"Agder"	4202	2020	9999
305	Q90592		0935 Iveland	Iveland	"Aust-Agder"	0935	1886	2020
1082	Q90592		4218 Iveland	Iveland	"Agder"	4218	2020	9999
274	Q90593		0905 Lillesand	Lillesand	"Aust-Agder"	0905	1838	1962
294	Q90593		0926 Lillesand	Lillesand	"Aust-Agder"	0926	1962	2020
1079	Q90593		4215 Lillesand	Lillesand	"Agder"	4215	2020	9999
270	Q90595		0901 Risør	Risør	"Aust-Agder"	0901	1838	2020
1068	Q90595		4201 Risør	Risør	"Agder"	4201	2020	9999
271	Q90597		0902 Tvedestrand	Tvedestrand	"Aust-Agder"	0902	1838	1960
280	Q90597		0914 Tvedestrand	Tvedestrand	"Aust-Agder"	0914	1960	2020
1077	Q90597		4213 Tvedestrand	Tvedestrand	"Agder"	4213	2020	9999
311	Q90598		0940 Valle	Valle	"Aust-Agder"	0940	1838	2020
1085	Q90598		4221 Valle	Valle	"Agder"	4221	2020	9999
277	Q90600		0912 Vegårshei	Vegårshei	"Aust-Agder"	0912	1838	2020
1076	Q90600		4212 Vegårshei	Vegårshei	"Agder"	4212	2020	9999
297	Q90601		0929 Åmli	Åmli	"Aust-Agder"	0929	1838	2020
1081	Q90601		4217 Åmli	Åmli	"Agder"	4217	2020	9999
192	Q93633		0631 Flesberg	Flesberg	"Buskerud"	0631	1838	2020
994	Q93633		3050 Flesberg	Flesberg	"Viken"	3050	2020	9999
174	Q93703		0615 Flå	Flå	"Buskerud"	0615	1905	2020
983	Q93703		3039 Flå	Flå	"Viken"	3039	2020	9999
9	Q966777		0113 Borge	Borge	"Østfold"	0113	1838	1994
773	Q97821939		1812 Sømna	Sømna	"Nordland"	1812	1901	1964
424		Mangler i wikidata	1147 Avaldsnæs med Kopervik	Avaldsnæs med Kopervik	"Rogaland"	1147	1838	1866
166		Mangler i wikidata	0603 Holmsbu	Holmsbu	"Buskerud"	0603	1847	1964
39		Mangler i wikidata	0202 Hvitsten	Hvitsten	"Akershus"	0202	1838	1964
402		Mangler i wikidata	1128 Høgsfjord	Høgsfjord	"Rogaland"	1128	1864	1871
759		Mangler i wikidata	1752 Kolvereid og Foldereid	Kolvereid og Foldereid	"Nord-Trøndelag"	1752	1838	1886
751		Mangler i wikidata	1745 Namsos Landdistrikt	Namsos Landdistrikt	"Nord-Trøndelag"	1745	1860	1891
415		Mangler i wikidata	1139 Nærstrand	Nærstrand	"Rogaland"	1139	1838	1868
750		Mangler i wikidata	1745 Sævik	Sævik	"Nord-Trøndelag"	1745	1838	1846