sample_name,FARLAB_ID,start_time_local,end_time_local,dD,dD_SE,d18O,d18O_SE,dxs,dxs_SE,Quality_flags,precip_rate_mm,note
20161205_R1,2016-01-YW-110,2016-12-05 13:40,2016-12-05 18:00,-1.96,0.31,-1.58,0.04,10.71,0.44,- - - 4 - -,0.3,light rain
20161208_R1,2016-01-YW-183,2016-12-08 11:51,2016-12-08 14:07,-3.7,0.29,-1.07,0.04,4.83,0.41,- - - 4 - -,NaN,Set up the totalisator at kl 1156
20161208_R2,2016-01-YW-184,2016-12-08 14:07,2016-12-08 15:57,-5.65,0.28,-1.27,0.04,4.5,0.4,- - - 4 - -,NaN,NaN
20161208_R3,2016-01-YW-185,2016-12-08 15:57,2016-12-09 00:10,-6.07,0.3,-1.45,0.04,5.49,0.43,- - - 4 - -,NaN,NaN
20161209_R1,2016-01-YW-186,2016-12-09 00:10,2016-12-09 09:15,-24.18,0.29,-3.97,0.04,7.55,0.42,- - - 4 - -,9.3,Set up the totalisator
20161209_R2,2016-01-YW-187,2016-12-09 13:25,2016-12-10 00:05,-23.59,0.29,-3.97,0.04,8.17,0.42,- - - 4 - -,1.5,NaN
20161209_R3,2016-01-YW-188,2016-12-10 02:10,2016-12-12 11:10,-32.12,0.3,-5.42,0.04,11.26,0.43,- - - 4 - -,13.3,NaN
20161212_R1,2016-01-YW-189,2016-12-12 11:30,2016-12-13 10:00,-28.74,0.29,-4.98,0.04,11.09,0.42,- - - 4 - -,13.7,NaN
20161215_R1,2016-01-YW-190,2016-12-13 13:30,2016-12-15 14:00,-32.56,0.3,-4.4,0.04,2.65,0.43,- - - 4 - -,NaN,NaN
20161216_R1,2016-01-YW-191,2016-12-16 09:00,2016-12-16 23:30,-27.83,0.29,-4.24,0.04,6.1,0.4,- - - 4 - -,2.5,NaN
20161217_R1,2016-01-YW-192,2016-12-16 23:30,2016-12-18 00:20,-39.47,0.3,-6.55,0.04,12.93,0.42,- - - 4 - -,39.5,NaN
20161218_R1,2016-01-YW-193,2016-12-18 00:20,2016-12-18 22:00,-15.45,0.31,-3.31,0.04,11.04,0.43,- - - 4 - -,4,NaN
20161219_R1,2016-01-YW-194,2016-12-18 22:00,2016-12-19 21:45,-7.98,0.3,-1.91,0.04,7.28,0.42,- - - 4 - -,NaN,NaN
20161220_R1,2016-01-YW-195,2016-12-19 21:45,2016-12-21 11:30,-59.81,0.29,-8.87,0.04,11.15,0.43,- - - - - -,NaN,NaN
20161221_R1,2016-01-YW-196,2016-12-21 11:30,2016-12-21 11:40,-67.42,0.28,-9.63,0.04,9.66,0.42,- - - - - -,NaN,strong wind 10 ms
20161221_R2,2016-01-YW-197,2016-12-21 11:50,2016-12-22 00:00,-43.05,0.28,-8.17,0.04,22.31,0.4,- - - - - -,NaN,ice balls in the evening
20161222_R1,2016-01-YW-198,2016-12-22 00:30,2016-12-22 13:00,-32.02,0.3,-6.16,0.04,17.24,0.43,- - - 4 - -,NaN,NaN
20161222_R2,2016-01-YW-199,2016-12-22 13:30,2016-12-22 18:40,-38.79,0.31,-7.77,0.04,23.35,0.43,- - - 4 - -,NaN,ice balls
20161222_R3,2017-14-YW-001,2016-12-22 18:40,2016-12-22 20:20,-30.9,0.27,-4.8,0.04,7.51,0.4,- - - - - -,NaN,NaN
20161222_R4,2017-14-YW-002,2016-12-22 20:20,2016-12-23 02:10,-30,0.27,-6.55,0.04,22.42,0.4,- - - - - -,NaN,NaN
20161224_R1,2017-14-YW-010,2016-12-24 00:35,2016-12-24 13:20,-32.28,0.26,-6.8,0.04,22.15,0.4,- - - - - -,NaN,NaN
20161224_R2,2017-14-YW-011,2016-12-24 13:20,2016-12-24 14:15,-47.63,0.27,-8.91,0.04,23.67,0.41,- - - - 5 -,NaN,NaN
20161227_R1,2017-14-YW-012,2016-12-25 02:00,2016-12-27 12:30,-33.95,0.27,-6.02,0.04,14.19,0.41,- - - - - -,NaN,NaN
20161227_R2,2017-14-YW-013,2016-12-27 12:30,2016-12-27 19:00,-11.54,0.27,-3.85,0.04,19.24,0.4,- - - - - -,NaN,NaN
20161229_R1,2017-14-YW-014,2016-12-28 23:00,2016-12-29 12:20,1.37,0.27,-1.44,0.04,12.93,0.4,- - - - - -,NaN,NaN
20161229_R2,2017-14-YW-015,2016-12-29 12:20,2016-12-29 23:30,-2.74,0.26,-1.31,0.04,7.7,0.4,- - - - - -,NaN,NaN
20161230_R1,2017-14-YW-016,2016-12-29 23:30,2016-12-30 10:30,-19.4,0.27,-3.42,0.04,7.93,0.4,- - - - - -,NaN,NaN
20161230_R2,2017-14-YW-017,2016-12-30 10:30,2016-12-30 13:30,-29.27,0.27,-4.37,0.04,5.67,0.4,- - - - - -,NaN,NaN
20161230_R3,2017-14-YW-018,2016-12-30 13:30,2016-12-30 19:40,-15.16,0.27,-2.74,0.04,6.77,0.4,- - - - - -,NaN,NaN
20161230_R4,2017-14-YW-019,2016-12-30 19:40,2016-12-31 01:20,-41.69,0.27,-5.93,0.04,5.76,0.4,- - - - - -,NaN,NaN
20161231_R1,2017-14-YW-020,2016-12-31 01:20,2016-12-31 15:30,-52.33,0.27,-7.7,0.04,9.28,0.41,- - - - - -,NaN,NaN
20161231_R2,2017-14-YW-021,2016-12-31 15:30,2016-12-31 23:30,-18.14,0.26,-4.48,0.04,17.72,0.39,- - - - - -,NaN,NaN
20170108_R1,2017-14-YW-042,2017-01-08 05:00,2017-01-08 18:00,-15.47,0.27,-3.25,0.04,10.49,0.41,- - - - - -,NaN,NaN
20170108_R2,2017-14-YW-043,2017-01-08 18:00,2017-01-09 00:15,-28.16,0.26,-4.06,0.04,4.34,0.4,- - - - - -,NaN,NaN
20170109_R1,2017-14-YW-044,2017-01-09 09:45,2017-01-09 10:50,-23.59,0.26,-3.71,0.04,6.13,0.4,- - - - - -,NaN,NaN
20170109_R2,2017-14-YW-045,2017-01-09 10:50,2017-01-09 13:00,-25.75,0.27,-4.31,0.04,8.76,0.4,- - - - - -,NaN,NaN
20170109_R3,2017-14-YW-046,2017-01-09 13:00,2017-01-09 17:25,-49.67,0.27,-7.41,0.04,9.62,0.4,- - - - - -,NaN,NaN
20170109_R4,2017-14-YW-047,2017-01-09 17:25,2017-01-09 21:20,-88.72,0.27,-12.19,0.04,8.79,0.4,- - - - - -,NaN,NaN
20170109_R5,2017-14-YW-048,2017-01-09 21:20,2017-01-09 22:08,-73.86,0.25,-10.44,0.04,9.62,0.39,- - - - - -,NaN,NaN
20170110_R1,2017-14-YW-049,2017-01-10 01:30,2017-01-10 16:20,-23.64,0.26,-3.71,0.04,6.02,0.4,- - - - - -,NaN,NaN
20170110_R2,2017-14-YW-050,2017-01-10 16:20,2017-01-10 22:30,-46.08,0.27,-7.42,0.04,13.25,0.4,- - - - 5 -,NaN,NaN
20170509_GFI_1,2017-14-YW-061,2017-05-09 08:30,2017-05-09 14:15,-59.98,0.26,-8.72,0.04,9.74,0.39,- - - - - -,NaN,first rain after a long dry period and collected to check the strong evporation below cloud
20170509_GFI_2,2017-14-YW-062,2017-05-09 14:15,2017-05-09 16:15,-79.28,0.27,-10.8,0.04,7.14,0.39,- - - - - -,NaN,first rain after a long dry period and collected to check the strong evporation below cloud
20170509_GFI_3,2017-14-YW-063,2017-05-09 16:15,2017-05-09 18:00,-97.04,0.27,-12.08,0.04,-0.37,0.4,- - - - - -,NaN,first rain after a long dry period and collected to check the strong evporation below cloud
20161207_T3,2017-14-YW-064,2016-12-07 23:00,2016-12-08 11:30,-33.66,0.26,-4.55,0.04,2.77,0.41,- - - - - -,1.9,NaN
20161209_T1_saved,2017-14-YW-065,2016-12-09 00:10,2016-12-09 09:15,-24.3,0.28,-3.3,0.04,2.11,0.41,- - - - - -,9.3,NaN
20161209_T2,2017-14-YW-066,2016-12-09 09:28,2016-12-10 00:00,-26.68,0.26,-4.23,0.04,7.18,0.39,- - - - - -,1.5,NaN
20161209_T3_saved,2017-14-YW-067,2016-12-09 02:10,2016-12-12 11:30,-30.98,0.27,-4.24,0.04,2.9,0.4,- - - - - -,13.3,NaN
20161215_T1,2017-14-YW-068,2016-12-15 09:00,2016-12-15 14:00,-34.59,0.28,-4.68,0.04,2.89,0.41,- - - - - -,NaN,NaN
20161216_T1,2017-14-YW-069,2016-12-16 09:00,2016-12-16 23:30,-30.18,0.28,-4.64,0.04,6.94,0.41,- - - - - -,2.5,NaN
20161217_T1,2017-14-YW-070,2016-12-16 23:30,2016-12-18 00:20,-44.27,0.27,-7.06,0.04,12.21,0.4,- - - - - -,39.5,NaN
20161218_T1_saved,2017-14-YW-071,2016-12-18 00:20,2016-12-18 22:00,-18.29,0.27,-2.58,0.04,2.32,0.41,- - - - - -,4,NaN
20161219_T1,2017-14-YW-072,2016-12-18 22:00,2016-12-20 01:00,-2.8,0.28,-1.22,0.04,6.99,0.43,- - - - - -,6.8,NaN
20161221_T1,2017-14-YW-073,2016-12-20 01:00,2016-12-21 00:00,-47.74,0.27,-8.77,0.04,22.38,0.41,- - - - - -,4.5,NaN
20161222_T1,2017-14-YW-074,2016-12-22 00:30,2016-12-23 02:10,-38.89,0.27,-7.52,0.04,21.29,0.4,- - - - - -,14.5,NaN
20161223_T1,2017-14-YW-075,2016-12-23 02:10,2016-12-23 16:50,-34.47,0.27,-6.83,0.04,20.19,0.41,- - - - - -,8.5,NaN
20161223_T2,2017-14-YW-076,2016-12-23 16:50,2016-12-24 00:35,-94.18,0.27,-12.85,0.04,8.65,0.4,- - - - - -,31,heavy rain
20161224_T1,2017-14-YW-077,2016-12-24 00:35,2016-12-24 13:20,-33.51,0.28,-7.02,0.04,22.66,0.42,- - - - - -,6.4,NaN
20161227_T1,2017-14-YW-078,2016-12-24 14:15,2016-12-27 12:30,-44.25,0.27,-7.21,0.04,13.44,0.4,- - - - - -,41,NaN
20161229_T1,2017-14-YW-079,2016-12-27 12:30,2016-12-29 23:30,-2.14,0.27,-2.08,0.04,14.47,0.41,- - - - - -,11.5,NaN
20161230_T1,2017-14-YW-080,2016-12-29 23:30,2016-12-30 10:30,-20.72,0.27,-3.77,0.04,9.44,0.4,- - - - - -,21,NaN
20161231_T1,2017-14-YW-081,2016-12-30 10:30,2016-12-31 15:30,-41.75,0.27,-6.23,0.04,8.06,0.4,- - - - - -,33.4,NaN
20170102_T1,2017-14-YW-082,2016-12-31 23:30,2017-01-02 11:30,-49.68,0.27,-8.56,0.04,18.81,0.4,- - - - - -,6.2,NaN
20170103_T1,2017-14-YW-083,2017-01-02 11:30,2017-01-03 13:30,-49.31,0.27,-7.76,0.04,12.8,0.4,- - - - - -,12.8,NaN
20170104_T1,2017-14-YW-084,2017-01-03 13:30,2017-01-04 13:30,-61.82,0.26,-9.87,0.04,17.16,0.39,- - - - - -,14,NaN
20170106_T1,2017-14-YW-085,2017-01-06 07:00,2017-01-07 02:55,-41.79,0.27,-6.69,0.04,11.72,0.42,- - - - - -,22.5,NaN
20170108_T1,2017-14-YW-086,2017-01-08 05:00,2017-01-09 00:15,-19.5,0.26,-3.6,0.04,9.28,0.39,- - - - - -,10,NaN
20170109_T1,2017-14-YW-087,2017-01-09 00:15,2017-01-09 09:45,-23.21,0.27,-3.48,0.04,4.65,0.4,- - - - - -,2.7,NaN
20170109_T1,2017-14-YW-088,2017-01-09 00:15,2017-01-09 22:08,-61.75,0.26,-8.87,0.04,9.2,0.4,- - - - - -,28.8,NaN
20170110_T1,2017-14-YW-089,2017-01-10 01:30,2017-01-10 22:30,-48.31,0.26,-7.65,0.04,12.93,0.4,- - - - 5 -,8.2,NaN
20170111_T1,2017-14-YW-090,2017-01-10 22:30,2017-01-11 14:30,-66.92,0.27,-9.42,0.04,8.45,0.4,- - - - - -,30.5,NaN
20170113,2017-14-YW-091,2017-01-11 14:30,2017-01-13 13:30,-75.58,0.27,-11.52,0.04,16.57,0.39,- - - - - -,46.8,NaN
20170119,2017-14-YW-092,2017-01-17 10:00,2017-01-19 07:45,-39.41,0.26,-5.83,0.04,7.27,0.39,- - - - - -,56.5,NaN
20170120,2017-14-YW-093,2017-01-19 07:45,2017-01-20 07:30,-5.67,0.27,-1.38,0.04,5.39,0.4,- - - - - -,8.1,NaN
20170123,2017-14-YW-094,2017-01-20 17:30,2017-01-23 13:30,-10.61,0.27,-2.49,0.04,9.29,0.41,- - - - - -,16.5,NaN
20170124,2017-14-YW-095,2017-01-23 13:30,2017-01-24 14:30,-13.36,0.27,-2.91,0.04,9.94,0.4,- - - - - -,NaN,NaN
20170125,2017-14-YW-096,2017-01-24 14:30,2017-01-25 15:00,-9.84,0.26,-2.52,0.04,10.34,0.4,- - - - - -,5,NaN
20170126,2017-14-YW-097,2017-01-25 16:00,2017-01-26 10:45,-5.53,0.28,-1.98,0.04,10.27,0.41,- - - - - -,0.05,too little and supposed to be discarded
20170128,2017-14-YW-098,2017-01-28 10:00,2017-01-28 19:30,-58.12,0.26,-7.59,0.04,2.6,0.4,- - - - - -,2.6,NaN
20170129,2017-14-YW-099,2017-01-28 19:30,2017-01-29 13:15,-40.81,0.27,-5.22,0.04,0.91,0.4,- - - - - -,3.8,NaN
20170130,2017-14-YW-100,2017-01-29 13:15,2017-01-29 20:00,-97.18,0.28,-13.51,0.04,10.91,0.4,- - - - - -,15,NaN
20170201,2017-14-YW-101,2017-01-31 19:30,2017-02-01 17:00,-139.02,0.28,-18.06,0.04,5.47,0.41,- - - 4 - -,8.4,NaN
20170202,2017-14-YW-102,2017-02-01 17:00,2017-02-01 23:00,-112.5,0.27,-13.65,0.04,-3.27,0.41,- - - - - -,5.4,NaN
20170203,2017-14-YW-103,2017-02-03 10:00,2017-02-03 17:00,-61.64,0.27,-7.59,0.04,-0.96,0.41,- - - - - -,2.7,NaN
20170206,2017-14-YW-104,2017-02-04 19:00,2017-02-04 21:00,-71.54,0.26,-8.95,0.04,0.04,0.4,- - - - - -,1.3,NaN
20170216,2017-14-YW-105,2017-02-15 15:00,2017-02-16 23:00,-61.02,0.26,-8.57,0.04,7.56,0.39,- 2 - - - -,12,NaN
20170219,2017-14-YW-106,2017-02-18 20:15,2017-02-19 23:50,-58.33,0.26,-8.05,0.04,6.07,0.4,- - - - - -,21,NaN
20170220,2017-14-YW-107,2017-02-19 23:50,2017-02-21 11:00,-68.68,0.27,-9.32,0.04,5.89,0.4,- - - - - -,35,NaN
20170222A,2017-14-YW-108,2017-02-21 18:00,2017-02-22 14:30,-100.46,0.25,-13.82,0.04,10.13,0.38,- - - - - -,23,NaN
20170222B,2017-14-YW-109,2017-02-22 14:30,2017-02-22 19:30,-60.18,0.26,-9.1,0.04,12.61,0.39,- - - - 5 -,2,NaN
20170227,2017-14-YW-110,2017-02-25 20:00,2017-02-28 08:00,-66.59,0.26,-8.92,0.04,4.76,0.4,- - - - - -,10,maybe start at 2017-02-25 kl 0900
20170301,2017-14-YW-111,2017-03-01 08:00,2017-03-01 22:00,-52.28,0.26,-8.76,0.04,17.83,0.38,- - - - - -,6.5,graupel and observed one thunder and short and intensive and not captured in forecast 
20170302,2017-14-YW-112,2017-03-01 22:00,2017-03-02 20:00,-60.01,0.27,-8.88,0.04,11.01,0.4,- - - - - -,NaN,rain
20170309,2017-14-YW-113,2017-03-08 12:00,2017-03-09 17:00,-43.44,0.25,-7.01,0.04,12.65,0.39,- - - - - -,8.5,snow plus rain
20170310,2017-14-YW-114,2017-03-10 00:00,2017-03-10 18:00,-42.27,0.26,-6.96,0.04,13.43,0.39,- - - - - -,NaN,rain
20170311,2017-14-YW-115,2017-03-11 12:00,2017-03-12 01:00,-55.89,0.26,-7.94,0.04,7.64,0.38,- - - - - -,NaN,light rain and 3 x 20ml vial
20170312,2017-14-YW-116,2017-03-12 01:00,2017-03-13 00:30,-26.04,0.26,-4.33,0.04,8.63,0.4,- - - - - -,NaN,light rain and 0.8 x 20ml vial
20170313,2017-14-YW-117,2017-03-13 00:30,2017-03-13 23:30,-31.3,0.27,-5.41,0.04,12.02,0.4,- - - - - -,NaN,230 ml
20170314,2017-14-YW-118,2017-03-13 23:30,2017-03-14 23:30,-28.76,0.26,-5.1,0.04,12.02,0.39,- - - - - -,NaN,rain with showers and 480 ml
20170315,2017-14-YW-119,2017-03-14 23:30,2017-03-15 23:30,-20.31,0.27,-4.93,0.04,19.12,0.4,- - - - - -,NaN,260 ml
20170317,2017-14-YW-120,2017-03-15 23:30,2017-03-17 22:30,-46.29,0.26,-7.42,0.04,13.09,0.39,- - - - - -,28,NaN
20170320,2017-14-YW-121,2017-03-17 22:30,2017-03-20 13:50,-66.29,0.26,-9.58,0.04,10.33,0.39,- - - - - -,6.1,NaN
20170321,2017-14-YW-122,2017-03-20 13:50,2017-03-21 11:40,-52.11,0.26,-8.09,0.04,12.63,0.39,- - - - - -,8.6,NaN
20170322,2017-14-YW-123,2017-03-21 11:40,2017-03-22 17:40,-58.05,0.26,-9.33,0.04,16.61,0.39,- - - - - -,7.6,NaN
20170323,2017-14-YW-124,2017-03-22 17:40,2017-03-23 16:20,-34.28,0.26,-7.19,0.04,23.27,0.39,- - - - - -,7.2,NaN
20170324,2017-14-YW-125,2017-03-23 16:20,2017-03-24 17:30,-37.77,0.25,-6.77,0.04,16.36,0.39,- - - - - -,14.8,NaN
20170325,2017-14-YW-126,2017-03-24 17:30,2017-03-25 21:00,-10.65,0.26,-2.48,0.04,9.19,0.39,- - - - - -,3.9,NaN
20170327,2017-14-YW-127,2017-03-25 21:00,2017-03-27 16:00,-5.26,0.26,-1.23,0.04,4.54,0.39,- 2 - - - -,0.4,NaN
20170330,2017-14-YW-128,2017-03-29 17:00,2017-03-30 18:15,-69.69,0.26,-9.57,0.04,6.88,0.39,- 2 - - - -,12.2,NaN
20170331,2017-14-YW-129,2017-03-30 18:15,2017-03-31 16:15,-69.94,0.27,-9.48,0.04,5.94,0.41,- 2 - - - -,8,NaN
20170403,2017-14-YW-130,2017-03-31 16:15,2017-04-03 13:30,-40.27,0.26,-6.1,0.04,8.5,0.4,- 2 - - - -,18.5,NaN
20170404,2017-14-YW-131,2017-04-03 13:30,2017-04-04 16:20,-33.8,0.26,-5.09,0.04,6.92,0.39,- 2 - - - -,7.5,NaN
20170405,2017-14-YW-132,2017-04-04 16:20,2017-04-05 16:30,-24.98,0.26,-5.27,0.04,17.2,0.4,- - - - 5 -,12.2,NaN
20170406_1,2017-14-YW-133,2017-04-05 16:30,2017-04-06 11:25,-27.82,0.26,-4.89,0.04,11.29,0.39,- 2 - - - -,9.5,squall like onset
20170406_2,2017-14-YW-134,2017-04-06 11:25,2017-04-06 16:00,-30.21,0.27,-4.58,0.04,6.44,0.4,- 2 - - - -,18.2,NaN
20170407,2017-14-YW-135,2017-04-06 16:00,2017-04-07 11:00,-20.17,0.26,-3.17,0.04,5.21,0.4,- 2 - - - -,23,NaN
20170410,2017-14-YW-136,2017-04-07 11:00,2017-04-10 19:15,-28.49,0.25,-4.64,0.04,8.67,0.39,- 2 - - - -,17.5,NaN
20170411,2017-14-YW-137,2017-04-10 19:15,2017-04-11 17:10,-45.07,0.26,-7.39,0.04,14.07,0.39,- 2 - - - -,4,NaN
20170412,2017-14-YW-138,2017-04-11 17:10,2017-04-12 14:50,-42.87,0.24,-6.46,0.04,8.81,0.38,- 2 - - - -,10,NaN
20170414,2017-14-YW-139,2017-04-12 14:50,2017-04-14 13:00,-51.05,0.26,-7.44,0.04,8.5,0.4,- 2 - - - -,4.3,NaN
20170419,2017-14-YW-140,2017-04-19 10:30,2017-04-19 23:30,-7.78,0.26,-2.92,0.04,15.6,0.39,- 2 - - - -,2.7,NaN
20170420,2017-14-YW-141,2017-04-19 23:30,2017-04-20 19:00,-22.72,0.25,-3.67,0.04,6.63,0.39,- 2 - - - -,22.2,NaN
20170421,2017-14-YW-142,2017-04-20 19:00,2017-04-21 22:30,-27.71,0.26,-5.55,0.04,16.71,0.39,- 2 - - - -,8,NaN
20170423,2017-14-YW-143,2017-04-21 22:30,2017-04-24 04:20,-75.44,0.27,-11.19,0.04,14.06,0.4,- - - - - -,17,snow plus rain
20170427,2017-14-YW-144,2017-04-24 04:20,2017-04-27 15:00,-81.53,0.27,-11.67,0.04,11.82,0.43,- - - - - -,39,no rain at the beginning
20170509,2017-14-YW-145,2017-05-09 08:30,2017-05-09 19:00,-81.17,0.26,-11.13,0.04,7.84,0.41,- - - - - -,4.5,NaN
20170510,2017-14-YW-146,2017-05-09 19:00,2017-05-10 18:00,-101.57,0.28,-13.6,0.04,7.26,0.43,- - - - - -,1.8,NaN
20170512,2017-14-YW-147,2017-05-10 18:00,2017-05-12 20:00,-41.39,0.28,-5.78,0.04,4.84,0.42,- - - - - -,1.3,sunny with several light shower
20170515,2017-14-YW-148,2017-05-12 20:00,2017-05-16 01:00,-41.24,0.27,-5.86,0.04,5.66,0.42,- - - - - -,6.1,light shower on 14th night and sunny on 15th
20170516,2017-14-YW-149,2017-05-16 01:00,2017-05-17 01:00,-48.3,0.26,-6.77,0.04,5.89,0.4,- - - - - -,10.5,NaN
20170518,2017-14-YW-150,2017-05-17 20:00,2017-05-18 16:00,-86.97,0.26,-11.49,0.04,4.94,0.4,- - - - - -,NaN,NaN
20170521,2017-14-YW-151,2017-05-20 10:00,2017-05-22 00:00,-48.42,0.27,-6.32,0.04,2.11,0.42,- - - - - -,1.6,light rain on 20th and cloudy on 21st
20170525,2017-14-YW-152,2017-05-25 00:00,2017-05-26 10:00,-6.37,0.27,-1.13,0.04,2.65,0.42,- - - - - -,6.5,cloudy with rain
20170531,2017-14-YW-153,2017-05-31 00:00,2017-05-31 14:00,-19.92,0.29,-3.46,0.04,7.78,0.44,- - - - - -,1.2,light rain
20170602,2017-14-YW-154,2017-06-02 00:00,2017-06-03 01:00,-30.71,0.27,-4.76,0.04,7.37,0.4,- - - - - -,16.5,NaN
20170604,2017-14-YW-155,2017-06-03 18:00,2017-06-04 22:00,-40.27,0.26,-6.18,0.04,9.16,0.4,- - - - 5 -,20,light rain before kl 1800 then sunny then heavy rain after kl 1800 
20170606,2017-14-YW-156,2017-06-05 18:00,2017-06-06 19:00,-53.66,0.26,-7.65,0.04,7.55,0.41,- - - - - -,18,NaN
20170608,2017-14-YW-157,2017-06-07 18:00,2017-06-08 18:00,-99.97,0.27,-12.85,0.04,2.85,0.4,- - - - - -,12,NaN
20170609,2017-14-YW-158,2017-06-09 09:00,2017-06-09 20:00,-65.94,0.27,-8.56,0.04,2.55,0.41,- - - - - -,8,NaN
20170611,2017-14-YW-159,2017-06-11 00:00,2017-06-11 11:00,-39.61,0.26,-5.74,0.04,6.29,0.41,- - - - - -,4.5,heavy shower kl 1030 to 1100
20170613,2017-14-YW-160,2017-06-12 09:00,2017-06-14 12:00,-33.59,0.26,-4.71,0.04,4.09,0.41,- - - - - -,22.3,sunny after kl 1200
20170615,2017-14-YW-161,2017-06-15 18:00,2017-06-16 10:00,-53.38,0.27,-8.21,0.04,12.31,0.41,- - - - - -,37.5,NaN
20170617,2017-14-YW-162,2017-06-17 12:00,2017-06-17 21:00,-15.56,0.28,-2.85,0.04,7.2,0.43,- - - - - -,7,NaN
20170618,2017-14-YW-163,2017-06-17 21:00,2017-06-18 11:00,-26.31,0.29,-3.5,0.04,1.7,0.45,- - - - - -,14,R1 14 mm and R2 0618 kl 13-20 2.3 mm
20170619,2017-14-YW-164,2017-06-19 13:00,2017-06-19 19:00,-53.74,0.26,-7.38,0.04,5.33,0.41,- - - - - -,5.4,NaN
20170620,2017-14-YW-165,2017-06-20 00:00,2017-06-20 09:00,-36.36,0.27,-5.58,0.04,8.25,0.41,- - - - - -,3.5,NaN
20170623,2017-14-YW-166,2017-06-23 00:00,2017-06-23 22:00,-36.88,0.26,-5.52,0.04,7.28,0.42,- - - - - -,17,NaN
20170624,2017-14-YW-167,2017-06-24 12:00,2017-06-24 23:00,-35.95,0.27,-5.55,0.04,8.49,0.43,- - - - - -,7.5,showers and sun in between
20170625,2017-14-YW-168,2017-06-25 00:00,2017-06-26 10:00,-55.05,0.27,-8.02,0.04,9.13,0.42,- - - - - -,50,heavy rain stops at kl 1700 on 0625
20170707,2017-14-YW-169,2017-07-07 12:00,2017-07-08 01:00,-44.4,0.26,-6.35,0.04,6.4,0.41,- 2 - - - -,11.4,NaN
20170709,2017-14-YW-170,2017-07-09 06:00,2017-07-09 18:00,-26.74,0.28,-4.95,0.04,12.83,0.43,- - - - - -,6.6,NaN
20170711,2017-14-YW-171,2017-07-11 11:00,2017-07-11 14:00,-39,0.27,-4.81,0.04,-0.55,0.42,- - - - - -,1,NaN
20170717,2017-14-YW-172,2017-07-12 03:00,2017-07-17 09:00,-48.65,0.26,-7.5,0.04,11.39,0.41,- - - - - -,62,strong precipitation on day 15th and 16th 
20170718,2017-14-YW-173,2017-07-17 09:00,2017-07-18 14:30,-28.43,0.28,-4.43,0.04,6.97,0.43,- 2 - - - -,3.4,NaN
20170721,2017-14-YW-174,2017-07-18 14:30,2017-07-21 14:00,-33.09,0.27,-3.64,0.04,-3.98,0.42,- 2 - - - -,0.7,NaN
20170725,2017-14-YW-175,2017-07-25 12:00,2017-07-25 18:00,-65.96,0.27,-9.31,0.04,8.55,0.42,- 2 - - - -,1.9,NaN
20170728,2017-14-YW-176,2017-07-27 05:00,2017-07-28 11:00,-68.2,0.26,-9.16,0.04,5.05,0.4,- 2 - - - -,12.5,NaN
20170729,2017-14-YW-177,2017-07-28 11:00,2017-07-29 17:00,-52.8,0.28,-6.99,0.04,3.09,0.43,- 2 - - - -,3.8,NaN
20170801,2017-14-YW-178,2017-07-29 17:00,2017-08-01 08:00,-70.49,0.27,-9.8,0.04,7.93,0.41,- 2 - - - -,53,NaN
20170802,2017-14-YW-179,2017-08-02 01:00,2017-08-02 16:45,-58.48,0.31,-8.15,0.04,6.7,0.45,- 2 - - - -,19.7,NaN
20170803,2017-14-YW-180,2017-08-02 16:45,2017-08-02 19:00,-48.88,0.34,-5.06,0.05,-8.4,0.5,- 2 - - - -,0.5,NaN
20170804,2017-14-YW-181,2017-08-03 13:00,2017-08-04 04:00,-61.83,0.31,-7.06,0.04,-5.32,0.46,- 2 - - - -,10,NaN
20170806,2017-14-YW-182,2017-08-04 22:00,2017-08-06 16:00,-71.65,0.27,-9.9,0.04,7.57,0.42,- 2 - - - -,50.6,rainy
20170807,2017-14-YW-183,2017-08-06 16:00,2017-08-07 00:00,-65.55,0.27,-9.21,0.04,8.09,0.42,- 2 - - - -,26.9,NaN
20170808,2017-14-YW-184,2017-08-07 16:00,2017-08-08 16:00,-44.71,0.29,-6.82,0.04,9.88,0.42,- - - - - -,30.5,NaN
20170810,2017-14-YW-185,2017-08-10 08:00,2017-08-10 16:00,-12.38,0.29,-2.6,0.04,8.44,0.42,- 2 - - - -,2.2,NaN
20170811,2017-14-YW-186,2017-08-10 16:00,2017-08-11 17:00,-13.19,0.28,-2.47,0.04,6.61,0.42,- - - - - -,28.7,NaN
20170813,2017-14-YW-187,2017-08-11 17:00,2017-08-14 09:45,-33.63,0.28,-5.54,0.04,10.66,0.42,- - - - - -,34.5,NaN
20170814,2017-14-YW-188,2017-08-14 09:45,2017-08-14 17:00,-30.46,0.28,-5.47,0.04,13.32,0.42,- 2 - - - -,1.8,rain 
20170815,2017-14-YW-189,2017-08-15 18:00,2017-08-15 21:20,-65.29,0.27,-9.35,0.04,9.5,0.41,- 2 - - - -,12.7,strong shower for one hour
20170817,2017-14-YW-190,2017-08-17 13:00,2017-08-17 23:40,-63.82,0.28,-8.47,0.04,3.92,0.42,- 2 - - - -,14.5,NaN
20170818,2017-14-YW-191,2017-08-18 18:00,2017-08-19 00:00,-56.25,0.27,-7.86,0.04,6.65,0.4,- 2 - - - -,4.8,NaN
20170819,2017-14-YW-192,2017-08-19 12:00,2017-08-20 07:00,-66.49,0.28,-9.27,0.04,7.7,0.42,- 2 - - - -,33,NaN
20170821,2017-14-YW-193,2017-08-20 18:00,2017-08-21 11:00,-20.29,0.29,-3.55,0.04,8.07,0.42,- 2 - - - -,2.2,shower
20170828,2017-14-YW-194,2017-08-28 09:00,2017-08-29 08:00,-26.02,0.28,-4.25,0.04,8,0.43,- 2 - - - -,33,rain throughout the day
20170830,2017-14-YW-195,2017-08-30 09:00,2017-08-30 12:00,-24,0.29,-4.74,0.04,13.91,0.42,- 2 - - - -,2.2,shower
20170831,2017-14-YW-196,2017-08-31 12:00,2017-08-31 20:00,-35.76,0.28,-5.01,0.04,4.31,0.43,- 2 - - - -,0.9,showers kl 1300 to 1400 and 1730 to 1830
20170901,2017-14-YW-197,2017-08-31 20:00,2017-09-01 10:45,-59.86,0.28,-8.78,0.04,10.37,0.42,- 2 - - - -,8,NaN
20170905_total,2017-14-YW-242,2017-09-05 03:00,2017-09-05 23:25,-63.69,0.29,-8.77,0.04,6.47,0.42,- - - - 5 -,NaN,NaN
20170906_R1,2017-14-YW-243,2017-09-06 00:00,2017-09-06 07:30,-63.44,0.29,-8.82,0.04,7.14,0.42,- - - - - -,6.6,totalizator
20170906_R2,2017-14-YW-244,2017-09-06 07:30,2017-09-06 16:30,-45.55,0.25,-6.21,0.04,4.15,0.38,- - - - - -,0.3,short shower kl 1500 to 1600
20170907,2017-14-YW-245,2017-09-06 16:30,2017-09-08 19:30,-67.79,0.27,-9.97,0.04,11.95,0.4,- - - - - -,5.5,mostly rains on 07th kl 1800 to 08th 0600 and on 08th kl 1600 to 1930
20170909,2017-14-YW-246,2017-09-08 20:30,2017-09-09 19:00,-95.95,0.27,-12.57,0.04,4.62,0.4,- - - - - -,15.1,big shower kl 1730 to 1830 and on 8th kl 2100 to 0600 and  on 9th kl 0800 to 1000
20170910,2017-14-YW-247,2017-09-09 21:00,2017-09-11 13:00,-87.76,0.29,-12.08,0.04,8.87,0.44,- - - - - -,23.5,NaN
20170912,2017-14-YW-248,2017-09-11 15:00,2017-09-12 14:30,-62.92,0.27,-7.07,0.04,-6.35,0.41,- - - - - -,0.5,NaN
20170913_R1,2017-14-YW-249,2017-09-12 16:00,2017-09-13 13:30,-59.56,0.27,-8.68,0.04,9.9,0.41,- - - - - -,8.7,NaN
20170913_R2,2017-14-YW-250,2017-09-13 15:30,2017-09-13 20:00,-62.36,0.26,-8.27,0.04,3.8,0.4,- - - - - -,3.7,NaN
20170914,2017-14-YW-251,2017-09-14 14:30,2017-09-14 16:00,-43.27,0.25,-6.21,0.04,6.42,0.39,- - - - - -,0.6,shower kl 1430 to 1500
20170919,2017-14-YW-252,2017-09-19 00:00,2017-09-20 08:30,-37.57,0.28,-5.9,0.04,9.62,0.43,- - - - - -,3.1,NaN
20170920,2017-14-YW-253,2017-09-20 10:00,2017-09-20 20:00,-33.23,0.28,-5.19,0.04,8.3,0.45,- - - - - -,3.5,light rain kl 1000 to 1200 and 1700 to 2000
20170921,2017-14-YW-254,2017-09-20 20:00,2017-09-21 23:00,-49.72,0.27,-6.55,0.04,2.68,0.42,- - - - - -,3.8,NaN
20170922_R1,2017-14-YW-255,2017-09-21 23:00,2017-09-22 08:00,-38.82,0.26,-4.65,0.04,-1.59,0.41,- - - - - -,0.3,sample filtered
20170922_R2,2017-14-YW-256,2017-09-22 08:00,2017-09-22 15:40,-25.71,0.26,-2.3,0.04,-7.34,0.4,- - - - - -,0.3,NaN
20171002_R1,2017-14-YW-257,2017-10-01 23:00,2017-10-02 10:50,-59.19,0.27,-8.06,0.04,5.29,0.4,- - - - - -,19,storm with strong wind
20171002_R2,2017-14-YW-258,2017-10-02 10:50,2017-10-02 18:00,-48.62,0.26,-7.2,0.04,8.94,0.4,- - - - - -,5,NaN
20171002_R3,2017-14-YW-259,2017-10-02 18:00,2017-10-02 22:30,-61.17,0.26,-8.87,0.04,9.77,0.41,- - - - - -,16.5,NaN
20171003_R1,2017-14-YW-260,2017-10-02 22:30,2017-10-03 06:30,-38.24,0.27,-5.55,0.04,6.16,0.4,- - - - - -,7.5,NaN
20171003_R2,2017-14-YW-261,2017-10-03 06:30,2017-10-03 15:00,-57.12,0.27,-7.87,0.04,5.83,0.4,- - - - - -,8,NaN
20171003_R3,2017-14-YW-262,2017-10-03 15:00,2017-10-03 17:40,-57.09,0.27,-8.35,0.04,9.69,0.4,- - - - - -,4.1,NaN
20171003_R4,2017-14-YW-263,2017-10-03 17:40,2017-10-03 21:30,-34.92,0.27,-5.46,0.04,8.77,0.4,- - - - - -,1,NaN
20171004_R1,2017-14-YW-264,2017-10-03 21:30,2017-10-04 11:00,-52.38,0.27,-8.19,0.04,13.14,0.4,- - - - - -,21.5,NaN
20171004_R2,2017-14-YW-265,2017-10-04 11:00,2017-10-04 16:30,-67.59,0.27,-10.4,0.04,15.58,0.4,- - - - - -,6.5,NaN
20171004_R3,2017-14-YW-266,2017-10-04 16:30,2017-10-04 20:30,-94.93,0.27,-13.44,0.04,12.58,0.41,- - - - - -,7,NaN
20171005_R1,2017-14-YW-267,2017-10-04 20:30,2017-10-05 15:30,-68.87,0.26,-10.04,0.04,11.44,0.39,- - - - - -,19.5,NaN
20171005_R2,2017-14-YW-268,2017-10-05 15:30,2017-10-05 17:30,-92.27,0.26,-12.6,0.04,8.51,0.39,- - - - - -,2,NaN
20171006_R1,2017-14-YW-269,2017-10-06 12:30,2017-10-06 15:00,-33.14,0.26,-5.5,0.04,10.89,0.39,- - - - - -,0.8,showers
20171006_R2,2017-14-YW-270,2017-10-06 15:30,2017-10-06 15:50,-25.24,0.27,-4.47,0.04,10.5,0.39,- - - - - -,0.1,shower
20171006_R3,2017-14-YW-271,2017-10-06 17:30,2017-10-07 00:20,-15.25,0.27,-4.4,0.04,19.97,0.4,- - - - - -,1.1,shower
20171007,2017-14-YW-272,2017-10-07 02:00,2017-10-07 06:00,-12.15,0.26,-3.97,0.04,19.57,0.39,- - - - - -,1.2,showers
20171010_R1,2017-14-YW-273,2017-10-10 00:00,2017-10-10 15:30,-63.82,0.26,-8.88,0.04,7.21,0.4,- - - - - -,8,NaN
20171010_R2,2017-14-YW-274,2017-10-10 17:30,2017-10-11 00:00,-29.54,0.26,-5.51,0.04,14.56,0.4,- - - - - -,1.6,showers
20171011,2017-14-YW-275,2017-10-11 04:00,2017-10-11 23:00,-65.35,0.27,-9.2,0.04,8.29,0.4,- - - - - -,23.3,NaN
20171012,2017-14-YW-276,2017-10-12 00:00,2017-10-12 20:00,-48.88,0.27,-7.81,0.04,13.64,0.41,- - - - - -,17,NaN
20171013,2017-14-YW-277,2017-10-13 09:00,2017-10-13 22:00,-34.34,0.27,-5.15,0.04,6.9,0.4,- - - - - -,31.5,NaN
20171016,2017-14-YW-278,2017-10-16 19:30,2017-10-16 23:00,-31.51,0.26,-4.69,0.04,6.01,0.39,- - - - - -,10.5,NaN
20171017_R1,2017-14-YW-279,2017-10-17 01:00,2017-10-17 14:00,-29.42,0.26,-4.86,0.04,9.46,0.39,- - - - - -,14.4,NaN
20171017_R2,2017-14-YW-280,2017-10-17 14:00,2017-10-17 21:00,-64.37,0.24,-9.09,0.04,8.37,0.38,- 2 - - - -,24.5,NaN
20171019,2017-14-YW-281,2017-10-19 20:00,2017-10-20 04:30,-59.74,0.26,-6.35,0.04,-8.94,0.39,- 2 - - - -,1.5,NaN
20171020,2017-14-YW-282,2017-10-20 11:00,2017-10-20 18:00,-63.09,0.25,-7.45,0.04,-3.5,0.39,- 2 - - - -,1,NaN
20171023,2017-14-YW-283,2017-10-23 22:00,2017-10-24 09:00,-83.28,0.25,-10.92,0.04,4.07,0.38,- 2 - - - -,9.6,collected in home made sampler and measured by small measuring cylinder
20171023_RS,2017-14-YW-284,2017-10-23 22:00,2017-10-24 09:00,-83.03,0.26,-10.8,0.04,3.41,0.4,- 2 - - - -,8,collected in totalizator and measured in big measuring cylinder
20171024,2017-14-YW-285,2017-10-24 12:50,2017-10-25 00:20,-36.68,0.26,-6.14,0.04,12.45,0.39,- - - - - -,8.7,collected in home made sampler and measured by small measuring cylinder
20171024_RS,2017-14-YW-286,2017-10-24 12:50,2017-10-25 00:20,-36.51,0.25,-6.1,0.04,12.26,0.38,- - - - - -,6.5,collected in totalizator and measured in big measuring cylinder
20171025_R1,2017-14-YW-287,2017-10-25 00:20,2017-10-25 13:30,-44.26,0.25,-7.02,0.04,11.89,0.38,- - - - - -,11,collected in home made sampler and measured by small measuring cylinder
20171025_R1_RS,2017-14-YW-288,2017-10-25 00:20,2017-10-25 13:30,-43.72,0.26,-6.88,0.04,11.3,0.39,- - - - - -,8,collected in totalizator and measured in big measuring cylinder
20171025_R2,2017-14-YW-289,2017-10-25 13:30,2017-10-25 21:00,-34.39,0.27,-5.13,0.04,6.65,0.41,- - - - - -,4.5,showers
20171025_R2_RS,2017-14-YW-290,2017-10-25 13:30,2017-10-25 21:00,-35.56,0.26,-5.29,0.04,6.74,0.39,- - - - - -,3.6,showers
20171026,2017-14-YW-291,2017-10-25 21:00,2017-10-26 15:00,-57.47,0.26,-8.09,0.04,7.25,0.4,- - - - - -,30,collected in home made sampler and measured by small measuring cylinder
20171026_RS,2017-14-YW-292,2017-10-25 21:00,2017-10-26 15:00,-57.75,0.26,-8.11,0.04,7.12,0.39,- - - - - -,21.5,collected in totalizator and measured in big measuring cylinder
20171027,2017-14-YW-293,2017-10-27 09:00,2017-10-27 19:00,-20.78,0.27,-3.93,0.04,10.65,0.4,- - - - - -,9.1,collected in home made sampler and measured by small measuring cylinder
20171027_RS,2017-14-YW-294,2017-10-27 09:00,2017-10-27 19:00,-20.57,0.26,-3.97,0.04,11.21,0.39,- - - - - -,6.1,collected in totalizator and measured in big measuring cylinder
20171028,2017-14-YW-295,2017-10-27 20:00,2017-10-30 14:00,-41.75,0.26,-6.48,0.04,10.09,0.4,- - - - - -,21.1,collected in home made sampler and measured by small measuring cylinder
20171028_RS,2017-14-YW-296,2017-10-27 20:00,2017-10-30 14:00,-43.23,0.26,-6.5,0.04,8.75,0.39,- - - - - -,15,collected in totalizator and measured in big measuring cylinder
20171030,2017-14-YW-297,2017-10-30 14:00,2017-10-31 00:20,-22.41,0.25,-5.41,0.04,20.88,0.39,- - - - - -,0.6,collected in home made sampler and measured by small measuring cylinder
20171030_RS,2017-14-YW-298,2017-10-30 14:00,2017-10-31 00:20,-21.66,0.26,-5.34,0.04,21.05,0.39,- - - - - -,0.3,collected in totalizator and measured in big measuring cylinder
20171101,2017-14-YW-299,2017-10-31 21:00,2017-11-02 05:00,-37,0.26,-5.61,0.04,7.86,0.4,- - - - - -,30.3,collected in home made sampler and measured by small measuring cylinder
20171101_RS,2017-14-YW-300,2017-10-31 21:00,2017-11-02 05:00,-37.34,0.26,-5.58,0.04,7.31,0.41,- - - - - -,21,collected in totalizator and measured in big measuring cylinder
20171105,2017-14-YW-301,2017-11-03 09:00,2017-11-05 16:00,-27.86,0.26,-5.62,0.04,17.11,0.41,- - - - - -,49,collected in home made sampler and measured by small measuring cylinder
20171105_RS,2017-14-YW-302,2017-11-03 09:00,2017-11-05 16:00,-27.64,0.26,-5.65,0.04,17.56,0.41,- - - - - -,34.5,collected in totalizator and measured in big measuring cylinder
20171108,2017-14-YW-303,2017-11-08 00:00,2017-11-09 00:00,-24.53,0.27,-5.12,0.04,16.45,0.42,- - - - - -,8.9,collected in home made sampler and measured by small measuring cylinder
20171108_RS,2017-14-YW-304,2017-11-08 00:00,2017-11-09 00:00,-23.61,0.26,-5.01,0.04,16.51,0.4,- - - - - -,6.1,collected in totalizator and measured in big measuring cylinder
20171109,2017-14-YW-305,2017-11-09 00:00,2017-11-10 00:00,-55.5,0.26,-8.54,0.04,12.82,0.41,- - - - - -,10,collected in home made sampler and measured by small measuring cylinder
20171109_RS,2017-14-YW-306,2017-11-09 00:00,2017-11-10 00:00,-58.84,0.26,-8.97,0.04,12.92,0.4,- - - - - -,23,collected in totalizator and measured in big measuring cylinder
20171110,2017-14-YW-307,2017-11-10 00:00,2017-11-11 00:00,-66.01,0.26,-10.56,0.04,18.5,0.42,- - - - - -,22,collected in home made sampler and measured by small measuring cylinder
20171110_RS,2017-14-YW-308,2017-11-10 00:00,2017-11-11 00:00,-66.01,0.26,-10.54,0.04,18.3,0.41,- - - - - -,14,collected in totalizator and measured in big measuring cylinder
20171111,2017-14-YW-309,2017-11-11 00:00,2017-11-12 23:00,-60.14,0.26,-9.69,0.04,17.4,0.41,- - - - - -,22,collected in home made sampler and measured by small measuring cylinder
20171111_RS,2017-14-YW-310,2017-11-11 00:00,2017-11-12 23:00,-60.38,0.26,-9.72,0.04,17.38,0.4,- - - - - -,14,collected in totalizator and measured in big measuring cylinder
20171114,2017-14-YW-311,2017-11-14 00:00,2017-11-16 02:30,-35.57,0.26,-6.59,0.04,17.16,0.4,- - - - - -,15,collected in home made sampler and measured by small measuring cylinder
20171114_RS,2017-14-YW-312,2017-11-14 00:00,2017-11-16 02:30,-36.26,0.26,-6.73,0.04,17.56,0.41,- - - - - -,11,collected in totalizator and measured in big measuring cylinder
20171116,2017-14-YW-313,2017-11-16 02:30,2017-11-17 22:50,-61.26,0.27,-9.46,0.04,14.4,0.4,- - - - - -,29,collected in home made sampler and measured by small measuring cylinder
20171116_RS,2017-14-YW-314,2017-11-16 02:30,2017-11-17 22:50,-60.43,0.26,-9.32,0.04,14.16,0.41,- - - - - -,21,collected in totalizator and measured in big measuring cylinder
20171118,2017-14-YW-315,2017-11-17 22:50,2017-11-18 17:00,-50.23,0.26,-8.74,0.04,19.71,0.4,- - - - - -,18,collected in home made sampler and measured by small measuring cylinder
20171118_RS,2017-14-YW-316,2017-11-17 22:50,2017-11-18 17:00,-49.64,0.26,-8.62,0.04,19.35,0.39,- - - - - -,13,collected in totalizator and measured in big measuring cylinder
20171123,2017-14-YW-317,2017-11-19 17:00,2017-11-24 22:00,-109.76,0.26,-14.88,0.04,9.27,0.4,- - - - - -,69,collected in home made sampler and measured by small measuring cylinder
20171123_RS,2017-14-YW-318,2017-11-19 17:00,2017-11-24 22:00,-110.46,0.27,-14.95,0.04,9.16,0.41,- - - - - -,47.5,collected in totalizator and measured in big measuring cylinder
20171125,2017-14-YW-319,2017-11-25 00:00,2017-11-26 16:00,-72.09,0.25,-10.91,0.04,15.16,0.4,- - - - - -,25.5,NaN
20171202,2018-35-YW-001,2017-12-02 07:00,2017-12-02 20:00,-32.92,0.27,-5.54,0.04,11.37,0.41,- - - - - -,8.5,first rain after a long dry period
20171203,2018-35-YW-002,2017-12-03 14:00,2017-12-03 22:00,-35.92,0.26,-7.06,0.04,20.59,0.39,- - - - - -,9,rain
20171205,2018-35-YW-003,2017-12-04 16:00,2017-12-05 20:00,-67.14,0.25,-9.33,0.04,7.46,0.38,- - - - - -,25.8,rain
20171206,2018-35-YW-004,2017-12-05 20:00,2017-12-06 20:20,-50.96,0.26,-7.27,0.04,7.22,0.39,- - - - - -,35.3,NaN
20171207,2018-35-YW-005,2017-12-06 20:20,2017-12-07 13:40,-48.54,0.26,-7.12,0.04,8.42,0.39,- - - - - -,34.5,rain and graupel
20171208_1,2018-35-YW-006,2017-12-07 21:30,2017-12-08 10:00,-63.79,0.26,-9.72,0.04,13.96,0.4,- - - - - -,8.5,light showers
20171208_2,2018-35-YW-007,2017-12-08 10:00,2017-12-08 16:00,-88.66,0.27,-13.04,0.04,15.7,0.4,- - - - - -,2.6,NaN
20171209,2018-35-YW-008,2017-12-08 16:00,2017-12-09 18:00,-47.59,0.26,-8.28,0.04,18.68,0.39,- - - - - -,2.3,wet snow
20171210,2018-35-YW-009,2017-12-09 18:00,2017-12-11 10:00,-46.5,0.25,-8.7,0.04,23.1,0.39,- - - - - -,1.8,NaN
20171213,2018-35-YW-010,2017-12-13 09:00,2017-12-13 17:40,-63.3,0.27,-9.73,0.04,14.52,0.4,- - - - - -,2.1,rain
20171217,2018-35-YW-011,2017-12-17 15:00,2017-12-19 23:10,-49.84,0.26,-7.52,0.04,10.36,0.39,- - - - - -,10.3,NaN
20171220,2018-35-YW-012,2017-12-20 04:00,2017-12-20 13:20,-33.44,0.27,-4.78,0.04,4.76,0.41,- - - - - -,7.5,NaN
20171221,2018-35-YW-013,2017-12-20 21:00,2017-12-21 23:50,-21.4,0.27,-4.74,0.04,16.49,0.4,- - - - - -,8,showers
20171222,2018-35-YW-014,2017-12-22 01:00,2017-12-23 19:00,-35.19,0.25,-5.63,0.04,9.82,0.38,- - - - - -,55,extreme rain bottle is overfilled
20171224,2018-35-YW-015,2017-12-23 23:00,2017-12-24 12:40,-73.37,0.26,-10.23,0.04,8.48,0.39,- - - - - -,6.7,NaN
20180102,2018-35-YW-016,2017-12-26 03:00,2018-01-02 01:30,-111.62,0.27,-15.19,0.04,9.88,0.39,- - - - - -,NaN,full bottle plus
20180108,2018-35-YW-017,2018-01-07 06:00,2018-01-08 04:00,-47.36,0.26,-8.53,0.04,20.85,0.39,- - - - - -,10,NaN
20180611,2018-35-YW-018,2018-06-10 03:00,2018-06-11 10:00,-29.58,0.22,-4.87,0.05,9.37,0.44,- - - - 5 -,4.2,NaN
20180614,2018-35-YW-019,2018-06-14 06:00,2018-06-14 10:30,-67.64,0.21,-8.74,0.05,2.29,0.45,- - - 4 - -,2.5,rain ongoing
20180615,2018-35-YW-020,2018-06-14 10:30,2018-06-15 09:00,-50.13,0.21,-7.28,0.05,8.14,0.45,- 2 - - - -,24.5,mostly from yesterday June 14th
20180618,2018-35-YW-021,2018-06-18 08:00,2018-06-18 13:30,-47.13,0.22,-6.71,0.05,6.57,0.45,- 2 - - 5 -,4.9,NaN
20180619_A,2018-35-YW-022,2018-06-18 21:00,2018-06-19 10:00,-34.35,0.24,-5.68,0.05,11.07,0.5,- 2 - - 5 -,7.3,NaN
20180619_B,2018-35-YW-023,2018-06-19 10:00,2018-06-19 21:00,-24.05,0.22,-3.98,0.05,7.82,0.46,- 2 - - - -,2,small showers
20180620,2018-35-YW-024,2018-06-19 21:00,2018-06-20 17:00,-30.67,0.24,-5.48,0.05,13.13,0.49,- - - - 5 -,5.7,NaN
20180621,2018-35-YW-025,2018-06-21 00:00,2018-06-21 16:00,-33.37,0.22,-5.32,0.05,9.16,0.46,- - - - 5 -,1.4,showers
20180624_A,2018-35-YW-026,2018-06-23 00:00,2018-06-24 05:00,-35.98,0.23,-5.49,0.05,7.91,0.46,- - - - 5 -,4.3,NB two standards on June 22th
20180624_B,2018-35-YW-027,2018-06-24 12:00,2018-06-24 21:00,-38.66,0.22,-4.65,0.05,-1.47,0.46,- 2 - - 5 -,1.5,NaN
20180625,2018-35-YW-028,2018-06-25 06:00,2018-06-25 15:00,0.91,0.22,-0.26,0.05,2.97,0.47,- 2 - - 5 -,0.5,drizzle
20180708,2018-35-YW-029,2018-07-08 18:00,2018-07-09 11:00,-15.6,0.21,-2.76,0.05,6.47,0.45,- 2 - - 5 -,2.3,NaN
20180722,2018-35-YW-030,2018-07-21 20:00,2018-07-22 03:00,-28.48,0.25,-4.15,0.06,4.75,0.53,- - - - 5 -,5.1,no rain before July 21th and sample needs filtering
20180723,2018-35-YW-031,2018-07-22 18:30,2018-07-23 02:00,-21.14,0.22,-3.61,0.05,7.77,0.47,- - - - 5 -,1.2,rain
20180724,2018-35-YW-032,2018-07-23 19:00,2018-07-24 14:40,-31.93,0.22,-5.19,0.05,9.57,0.47,- 2 - - - -,7.7,rain
20180725,2018-35-YW-033,2018-07-24 14:40,2018-07-25 06:00,-22.82,0.24,-3.81,0.06,7.7,0.52,- 2 - - 5 -,4.9,rain
20180730,2018-35-YW-034,2018-07-29 00:00,2018-07-30 14:00,-50.62,0.22,-7.06,0.05,5.83,0.47,- 2 - - 5 -,8.5,rain
20180801,2018-35-YW-035,2018-07-30 23:00,2018-07-31 20:00,-36.19,0.21,-4.3,0.05,-1.75,0.48,- 2 - - 5 -,3.1,rain
20180802,2018-35-YW-036,2018-08-02 06:00,2018-08-02 11:40,-27.84,0.21,-4.36,0.05,7.01,0.44,- 2 - - - -,1.3,rain
20180803,2018-35-YW-037,2018-08-02 11:40,2018-08-03 14:00,-22.11,0.22,-3.88,0.05,8.92,0.46,- 2 - - 5 -,7.1,rain
20180804,2018-35-YW-038,2018-08-03 06:00,2018-08-04 14:30,-40.21,0.21,-5.88,0.05,6.81,0.45,- 2 - - 5 -,3.4,NaN
20180806,2018-35-YW-039,2018-08-04 14:30,2018-08-06 10:00,-35.99,0.22,-5.29,0.05,6.37,0.49,- 2 - - 5 -,5,NaN
20180807,2018-35-YW-040,2018-08-06 10:00,2018-08-07 12:00,-65.9,0.22,-8.67,0.05,3.48,0.47,- - - - 5 -,2.1,rain
20180808,2018-35-YW-041,2018-08-08 16:00,2018-08-08 16:50,-34.08,0.26,-5.94,0.06,13.46,0.52,- 2 - - 5 -,6,rain
20180809,2018-35-YW-042,2018-08-08 16:50,2018-08-08 22:00,-35.86,0.2,-6.1,0.05,12.95,0.44,- 2 - - 5 -,9,rain
20180810_A,2018-35-YW-043,2018-08-10 05:00,2018-08-10 13:45,-89.18,0.21,-12.07,0.05,7.38,0.46,- 2 - - 5 -,10.1,rain
20180810_B,2018-35-YW-044,2018-08-10 13:45,2018-08-10 20:00,-71.5,0.22,-10.28,0.05,10.74,0.46,- 2 - - 5 -,13.6,rain
20180812,2018-35-YW-045,2018-08-11 08:00,2018-08-12 15:50,-47.68,0.23,-6.98,0.05,8.14,0.49,- 2 - - 5 -,1.1,rain
20180815,2018-35-YW-046,2018-08-15 00:00,2018-08-15 17:00,-24.01,0.23,-4.01,0.13,8.08,1.08,- - - - 5 -,1.2,rain
20180816,2018-35-YW-047,2018-08-15 19:00,2018-08-16 17:00,-45.52,0.21,-6.6,0.05,7.25,0.46,- - - - 5 -,26.7,rain
20180817,2018-35-YW-048,2018-08-16 17:00,2018-08-19 06:00,-43.66,0.22,-6.61,0.05,9.23,0.46,- - - - 5 -,45,rain
20180822,2018-35-YW-049,2018-08-22 04:00,2018-08-22 20:00,-45.63,0.22,-6.57,0.05,6.93,0.44,- - - - 5 -,40,NaN
20180823,2018-35-YW-050,2018-08-23 08:00,2018-08-24 08:45,-81.79,0.22,-11.74,0.05,12.11,0.45,- - - - - -,14,NaN
20180824_A,2018-35-YW-051,2018-08-24 14:00,2018-08-24 19:30,-54.14,0.22,-8.43,0.05,13.27,0.44,- - - - 5 -,10.5,NaN
20180824_B,2018-35-YW-052,2018-08-24 19:30,2018-08-24 20:40,-62.58,0.22,-9.78,0.05,15.67,0.45,- - - - 5 -,9.9,heavy shower
20180825,2018-35-YW-053,2018-08-24 20:40,2018-08-25 12:00,-58.46,0.23,-8.91,0.05,12.82,0.5,- - - - 5 -,5,NaN
20180826,2018-35-YW-054,2018-08-25 17:00,2018-08-26 12:00,-59.1,0.22,-8.64,0.05,10.02,0.47,- - - - 5 -,8.1,small showers
20180829,2018-35-YW-055,2018-08-29 07:00,2018-08-29 21:00,-44.06,0.21,-7.01,0.05,12,0.45,- - - - 5 -,15.6,NaN
20180906,2018-35-YW-056,2018-09-06 09:00,2018-09-06 21:00,-52.68,0.21,-8.05,0.05,11.73,0.45,- - - - 5 -,8.1,NaN
20180910,2018-35-YW-057,2018-09-09 03:00,2018-09-11 13:00,-51.68,0.21,-7.7,0.05,9.89,0.43,- - - - 5 -,64,heavy rain
20180912,2018-35-YW-058,2018-09-11 13:00,2018-09-12 13:30,-45.12,0.21,-7.08,0.05,11.49,0.48,- - - - 5 -,19.9,NaN
20180914,2018-35-YW-059,2018-09-12 13:30,2018-09-15 00:00,-43.54,0.22,-7,0.05,12.46,0.46,- 2 - - 5 -,31.4,NaN
20180916,2018-35-YW-060,2018-09-15 00:00,2018-09-16 15:40,-39.47,0.22,-6.55,0.05,12.93,0.46,- - - - 5 -,6.5,NaN
20180917,2018-35-YW-061,2018-09-16 15:40,2018-09-17 17:00,-34.47,0.22,-5.55,0.05,9.95,0.46,- - - - 5 -,8.1,NaN
20180918_A,2018-35-YW-062,2018-09-17 17:00,2018-09-18 08:00,-29.01,0.22,-4.76,0.05,9.1,0.47,- - - - 5 -,10,NaN
20180918_B,2018-35-YW-063,2018-09-18 19:00,2018-09-18 23:00,-23.64,0.22,-3.48,0.05,4.21,0.46,- - - - 5 -,9.5,NaN
20180919,2018-35-YW-064,2018-09-18 23:00,2018-09-20 12:00,-32.78,0.21,-5.04,0.05,7.55,0.46,- - - - 5 -,10,NaN
20180920,2018-35-YW-065,2018-09-20 12:00,2018-09-20 22:30,-26.18,0.22,-4.88,0.05,12.82,0.47,- - - - 5 -,6,NaN
20180921_A,2018-35-YW-066,2018-09-20 22:30,2018-09-21 15:20,-95.39,0.22,-12.14,0.05,1.72,0.45,- 2 - - 5 -,15.6,NaN
20180921_B,2018-35-YW-067,2018-09-21 15:20,2018-09-21 17:00,-80.38,0.26,-11.29,0.06,9.96,0.57,- - - - 5 -,5.2,intensive rain for one hour with thunder and lightning
20180922,2018-35-YW-068,2018-09-21 19:00,2018-09-24 13:00,-55.69,0.21,-8.33,0.05,10.95,0.44,- - - - 5 -,30.5,NaN
20180924,2018-35-YW-069,2018-09-24 13:00,2018-09-25 16:30,-20.32,0.22,-4.43,0.05,15.11,0.47,- - - - 5 -,7.5,NaN
20180927_A,2018-35-YW-105,2018-09-27 03:00,2018-09-27 13:00,-38.38,0.22,-6.23,0.05,11.47,0.48,- 2 - - - -,10.5,NaN
20180927_B,2018-35-YW-106,2018-09-27 13:00,2018-09-27 18:00,-64.96,0.22,-9.21,0.05,8.74,0.46,- - - - 5 -,4.5,NaN
20180927_C,2018-35-YW-107,2018-09-27 18:00,2018-09-28 01:00,-56.93,0.23,-8.57,0.05,11.63,0.49,- 2 - - 5 -,2,NaN
20180928,2018-35-YW-108,2018-09-28 01:00,2018-09-28 15:00,-42.98,0.21,-7.47,0.05,16.81,0.46,- - - - - -,3.6,NaN
20180930_A,2018-35-YW-109,2018-09-28 21:00,2018-09-30 01:00,-30.77,0.25,-5.83,0.06,15.86,0.52,- - - - 5 -,39.3,NaN
20180930_B,2018-35-YW-110,2018-09-30 01:00,2018-10-01 10:00,-47.22,0.22,-7.62,0.05,13.72,0.47,- - - - 5 -,16,NaN
20181002_A,2018-35-YW-111,2018-10-01 14:00,2018-10-02 10:00,-61.78,0.23,-9.96,0.05,17.89,0.49,- - - - 5 -,8.8,NaN
20181002_B,2018-35-YW-112,2018-10-02 10:00,2018-10-02 16:30,-37.93,0.22,-6.31,0.05,12.53,0.47,- - - - 5 -,5.6,NaN
20181003,2018-35-YW-113,2018-10-02 16:30,2018-10-03 14:15,-37.06,0.22,-6.95,0.05,18.57,0.46,- - - - 5 -,1.1,NaN
20181004,2018-35-YW-114,2018-10-03 14:15,2018-10-04 15:00,-23.66,0.22,-4.08,0.05,9.01,0.46,- 2 - - 5 -,8.9,NaN
20181005_A,2018-35-YW-115,2018-10-04 15:00,2018-10-05 08:45,-24.87,0.22,-4.36,0.05,9.98,0.48,- 2 - - 5 -,NaN,NaN
20181005_B,2018-35-YW-116,2018-10-05 08:45,2018-10-05 15:10,-27.3,0.21,-5.53,0.05,16.98,0.46,- 2 - - 5 -,1.6,NaN
20181007,2018-35-YW-117,2018-10-05 15:10,2018-10-08 13:00,-54.29,0.22,-8.17,0.05,11.04,0.46,- 2 - - 5 -,24.2,NaN
20181009_A,2018-35-YW-118,2018-10-08 13:00,2018-10-09 11:00,-41.39,0.21,-6.15,0.05,7.82,0.46,- 2 - - 5 -,34,NaN
20181009_B,2018-35-YW-119,2018-10-09 11:00,2018-10-09 14:00,-51.52,0.21,-7.02,0.05,4.62,0.45,- - - - 5 -,10.1,NaN
20181009_C,2018-35-YW-120,2018-10-09 14:00,2018-10-09 16:30,-52.19,0.22,-7.06,0.05,4.27,0.46,- 2 - - 5 -,5.7,NaN
20181010,2018-35-YW-121,2018-10-09 16:30,2018-10-10 18:15,-45.28,0.25,-6.12,0.06,3.66,0.51,- - - - 5 -,17.6,NaN
20181012_R1,2018-35-YW-122,2018-10-12 22:00,2018-10-13 01:00,-25.36,0.25,-5.09,0.06,15.37,0.52,- 2 - - 5 -,6.7,NaN
20181012_R2,2018-35-YW-123,2018-10-13 01:00,2018-10-13 15:00,-33.75,0.22,-5.57,0.05,10.84,0.45,- 2 - - 5 -,43.5,NaN
20181012_R3,2018-35-YW-124,2018-10-13 15:00,2018-10-13 17:20,-27.53,0.26,-4.61,0.06,9.38,0.56,- 2 - - 5 -,15,NaN
20181012_R4,2018-35-YW-125,2018-10-13 17:20,2018-10-13 18:20,-16.16,0.21,-3.3,0.05,10.27,0.45,- - - - 5 -,5.3,NaN
20181014,2018-35-YW-126,2018-10-14 09:00,2018-10-15 00:00,-72.97,0.21,-10.12,0.05,7.97,0.45,- - - - 5 -,22.2,NaN
20181017,2018-35-YW-127,2018-10-16 22:00,2018-10-17 22:00,-25.63,0.21,-4.27,0.05,8.56,0.46,- - - - 5 -,9.5,NaN
20181018,2018-35-YW-128,2018-10-17 22:00,2018-10-18 21:00,-18.49,0.21,-3.82,0.05,12.04,0.45,- - - - 5 -,1.6,NaN
20181019,2018-35-YW-129,2018-10-19 16:00,2018-10-19 20:30,-38.69,0.21,-6.48,0.05,13.13,0.45,- - - - - -,10.2,NaN
20181022_5,2018-35-YW-134,2018-10-19 20:30,2018-10-22 09:00,-31.39,0.21,-5.01,0.05,8.67,0.45,- - - - 5 -,51.1,20 plus 20 plus 10 plus 1.1
20181022_6,2018-35-YW-135,2018-10-22 08:35,2018-10-22 09:50,-21.3,0.23,-5.25,0.06,20.68,0.5,- 2 - - 5 -,NaN,NaN
20181023,2018-35-YW-136,2018-10-22 09:50,2018-10-23 16:00,-98.25,0.22,-13.75,0.05,11.77,0.49,- - - - 5 -,30.3,NaN
20181024,2018-35-YW-137,2018-10-24 16:00,2018-10-25 08:20,-24.27,0.21,-4.29,0.05,10.05,0.46,- 2 - - - -,6.5,NaN
20181025,2018-35-YW-138,2018-10-25 08:20,2018-10-26 10:00,-32.61,0.21,-5.72,0.05,13.18,0.44,- 2 - - 5 -,1.8,small short showers
20181031,2018-35-YW-139,2018-10-30 18:00,2018-10-31 09:00,-65.49,0.25,-9.23,0.08,8.33,0.7,- 2 - - 5 -,5.1,rain on and off
20181101,2018-35-YW-140,2018-10-31 09:00,2018-10-31 22:00,-63.59,0.21,-9.65,0.05,13.6,0.45,- - - - 5 -,4.8,NaN
20181102,2018-35-YW-141,2018-11-01 13:00,2018-11-02 16:15,-104.35,0.21,-14.52,0.05,11.79,0.46,- - - - 5 -,13.8,NaN
20181103,2018-35-YW-142,2018-11-02 16:15,2018-11-03 22:00,-19.94,0.22,-3.97,0.05,11.78,0.44,- - - - 5 -,2.1,NaN
20181108,2018-35-YW-143,2018-11-08 15:00,2018-11-08 23:30,-59.48,0.24,-7.94,0.06,4.03,0.52,- 2 - - 5 -,1,NaN
20181110,2018-35-YW-144,2018-11-10 15:00,2018-11-10 19:00,-67.77,0.22,-6.03,0.05,-19.51,0.45,- - - - 5 -,0.3,NaN
20181112,2018-35-YW-145,2018-11-11 02:00,2018-11-12 23:50,-75.6,0.24,-10.15,0.06,5.6,0.51,- - - - 5 -,7.6,NaN
20181113,2018-35-YW-146,2018-11-13 01:00,2018-11-14 23:00,-36.28,0.21,-5.64,0.05,8.82,0.45,- - - - 5 -,6,NaN
20181114,2018-35-YW-147,2018-11-14 16:00,2018-11-14 23:50,-45.17,0.23,-6.54,0.05,7.14,0.48,- - - - 5 -,3.8,NaN
20181115,2018-35-YW-148,2018-11-15 00:00,2018-11-15 20:00,-15.61,0.22,-3,0.05,8.35,0.46,- - - - 5 -,1.9,NaN
20180111,2018-35-YW-149,2018-01-10 19:00,2018-01-11 01:00,-74.97,0.21,-10.04,0.05,5.31,0.45,- - - - 5 -,1,NaN
20180115,2018-35-YW-150,2018-01-15 18:00,2018-01-16 12:00,-104.49,0.22,-14.07,0.05,8.07,0.46,- 2 - - 5 -,8.7,rain and snow after several dry days
20180116,2018-35-YW-151,2018-01-16 12:00,2018-01-17 20:40,-58.49,0.22,-9.83,0.05,20.12,0.46,- 2 - - 5 -,5.5,mostly snow frozen at funnel inlet
20180122,2018-35-YW-152,2018-01-17 20:40,2018-01-22 15:00,-68.29,0.21,-10.7,0.05,17.3,0.45,- 2 - - 5 -,3.4,NaN
20180123,2018-35-YW-153,2018-01-22 15:00,2018-01-23 22:00,-70.61,0.22,-9.81,0.05,7.86,0.46,- - - - - -,10.5,rain
20180124,2018-35-YW-154,2018-01-23 22:00,2018-01-24 21:30,-52.4,0.21,-7.62,0.05,8.53,0.47,- - - - 5 -,12.5,rain
20180125_1,2018-35-YW-155,2018-01-24 21:30,2018-01-25 15:20,-48.2,0.21,-7.4,0.05,11,0.44,- - - - 5 -,3.1,rain
20180125_2,2018-35-YW-156,2018-01-25 15:20,2018-01-25 22:50,-49.82,0.21,-7.98,0.05,14.04,0.46,- - - - - -,4.6,rain
20180126,2018-35-YW-157,2018-01-25 22:50,2018-01-26 12:40,-49.56,0.22,-8.21,0.05,16.11,0.48,- 2 - - 5 -,2.5,NaN
20180129,2018-35-YW-158,2018-01-26 12:40,2018-01-29 15:30,-79.18,0.22,-11.08,0.05,9.46,0.46,- 2 - - 5 -,35,rain and snow
20180130,2018-35-YW-159,2018-01-29 15:30,2018-01-30 13:00,-46.96,0.24,-7.75,0.05,15.05,0.5,- 2 - - 5 -,3.8,NaN
20180131,2018-35-YW-160,2018-01-30 13:00,2018-01-31 21:00,-89.21,0.22,-12.62,0.05,11.73,0.47,- 2 - - - -,27,rain
20180207,2018-35-YW-161,2018-02-07 05:00,2018-02-07 20:30,-46.53,0.21,-8.26,0.05,19.58,0.47,- 2 - - 5 -,1.2,snow and funnel inlet blocked
20180208,2018-35-YW-162,2018-02-07 20:30,2018-02-08 18:30,-52.77,0.22,-8.14,0.05,12.34,0.47,- 2 - - 5 -,7,wet snow and rain
20180209,2018-35-YW-163,2018-02-08 18:30,2018-02-09 18:30,-111.34,0.25,-14.59,0.06,5.4,0.52,- 2 - - 5 -,18.3,rain
20180212,2018-35-YW-164,2018-02-09 18:30,2018-02-12 15:30,-127.72,0.23,-16.78,0.05,6.49,0.48,- - - 4 5 -,17.7,wet snow
20180214,2018-35-YW-165,2018-02-12 15:30,2018-02-14 10:00,-63.52,0.22,-9.86,0.05,15.4,0.47,- 2 - - - -,17.4,wet snow
20180218,2018-35-YW-166,2018-02-16 05:00,2018-02-18 16:00,-62.94,0.21,-9.65,0.05,14.23,0.47,- 2 - - 5 -,16,rain
20180226,2018-35-YW-167,2018-02-26 03:00,2018-02-26 12:00,-43.66,0.21,-7.94,0.05,19.83,0.45,- 2 - - - -,7,snow and wet snow
20180304,2019-46-YW-001,2018-03-03 06:00,2018-03-03 16:00,-201.58,0.21,-25.01,0.06,-1.52,0.49,- - - 4 - -,11,snow and wet snow collected next day
20180307,2019-46-YW-002,2018-03-07 04:00,2018-03-07 17:10,-100.78,0.2,-13.72,0.05,9,0.47,- - - - 5 -,2,snow in morning and rain in afternoon
20180308,2019-46-YW-003,2018-03-08 02:00,2018-03-08 14:45,-108.13,0.2,-14.62,0.05,8.84,0.47,- - - - - -,1,light rain
20180309,2019-46-YW-004,2018-03-08 19:00,2018-03-09 13:00,-126.26,0.2,-17.08,0.05,10.36,0.47,- - - 4 - -,4,wet snow
20180310,2019-46-YW-005,2018-03-10 11:00,2018-03-10 14:20,-94.48,0.21,-12.88,0.05,8.59,0.45,- - - - - -,0.5,rain
20180321,2019-46-YW-006,2018-03-19 05:00,2018-03-21 14:00,-25.44,0.21,-5.33,0.05,17.18,0.45,- 2 - - - -,7,snow and rain after a long dry period
20180322,2019-46-YW-007,2018-03-21 14:00,2018-03-22 03:00,-95.46,0.21,-13.45,0.05,12.15,0.46,- 2 - - - -,9,rain and snow
20180324,2019-46-YW-008,2018-03-23 19:00,2018-03-24 08:00,-50.04,0.21,-6.82,0.05,4.51,0.46,- 2 - - - -,3,rain
20180326,2019-46-YW-009,2018-03-24 22:00,2018-03-25 20:00,-26.62,0.22,-4.39,0.05,8.54,0.49,- 2 - - 5 -,4.8,rain
20180327,2019-46-YW-010,2018-03-26 18:00,2018-03-27 15:00,-64.64,0.2,-9.45,0.05,10.99,0.48,- 2 - - - -,7.3,rain collected at 20180403 kl 1340 UTC
20180404,2019-46-YW-011,2018-04-03 15:00,2018-04-04 18:00,-80.37,0.21,-10.7,0.05,5.21,0.47,- 2 - - - -,21.2,snow at beginning mostly rain
20180405,2019-46-YW-012,2018-04-04 18:00,2018-04-05 09:00,-106.29,0.21,-14.51,0.06,9.83,0.49,- 2 - - - -,7.5,snow and rain
20180415,2019-46-YW-013,2018-04-16 19:00,2018-04-17 02:00,-39.38,0.22,-6.13,0.06,9.65,0.5,- 2 - - 5 -,19,rain after a long dry period
20180417,2019-46-YW-014,2018-04-17 17:50,2018-04-18 03:00,-26.09,0.2,-4.62,0.05,10.86,0.48,- 2 - - - -,7,rain
20180423,2019-46-YW-015,2018-04-22 14:00,2018-04-23 23:15,-39.84,0.2,-6.23,0.05,10,0.48,- 2 - - - -,18,rain after a dry period
20180424,2019-46-YW-016,2018-04-24 03:00,2018-04-24 13:00,-49.98,0.21,-7.04,0.05,6.35,0.47,- 2 - - - -,9.6,rain
20180425,2019-46-YW-017,2018-04-24 20:00,2018-04-25 12:40,-47.12,0.21,-6.6,0.05,5.67,0.47,- 2 - - - -,2.1,rain
20180426,2019-46-YW-018,2018-04-26 00:00,2018-04-26 18:00,-42.82,0.22,-6.12,0.06,6.11,0.5,- 2 - - - -,3,rain
20180501,2019-46-YW-019,2018-04-26 18:00,2018-04-28 17:00,-44.24,0.22,-6.41,0.06,7.07,0.5,- 2 - - - -,5.9,rain
20180503,2019-46-YW-020,2018-05-03 02:00,2018-05-03 16:00,-72.02,0.21,-9.96,0.06,7.66,0.5,- 2 - - - -,6.9,rain shower
20180504,2019-46-YW-021,2018-05-04 03:00,2018-05-04 19:15,-36.27,0.19,-5.48,0.05,7.57,0.44,- 2 - - 5 -,5,rain rate estimated
20180505,2019-46-YW-022,2018-05-04 19:15,2018-05-05 07:00,-30.65,0.2,-4.52,0.05,5.54,0.45,- - - - 5 -,3.2,NaN
20180506,2019-46-YW-023,2018-05-05 22:30,2018-05-06 13:30,-27.43,0.23,-4.51,0.05,8.64,0.48,- 2 - - 5 -,4.5,NaN
20180507,2019-46-YW-024,2018-05-07 01:00,2018-05-07 07:00,-25.13,0.2,-3.41,0.05,2.19,0.43,- - - - - -,3.3,NaN
20180510,2019-46-YW-025,2018-05-10 00:00,2018-05-11 06:00,-50.46,0.19,-7.7,0.05,11.14,0.45,- 2 - - 5 -,19.2,NaN
20180516,2019-46-YW-026,2018-05-16 06:00,2018-05-16 10:00,-12.56,0.22,-2.41,0.05,6.7,0.47,- 2 - - 5 -,0.9,rain after a hot day of 24 celsius
20181129,2019-46-YW-027,2018-11-29 00:00,2018-11-29 23:00,-56.79,0.21,-7.49,0.05,3.11,0.44,- 2 - - 5 -,6.6,warm air mass and first after 14 dry days 
20181130,2019-46-YW-028,2018-11-30 02:00,2018-11-30 22:30,-30.92,0.21,-5.34,0.05,11.84,0.48,- - - - 5 -,6.7,NaN
20181201,2019-46-YW-029,2018-11-30 22:30,2018-12-01 21:20,-44,0.2,-7.35,0.05,14.81,0.43,- - - - - -,9,NaN
20181203,2019-46-YW-030,2018-12-01 21:20,2018-12-04 15:00,-86.65,0.23,-11.75,0.05,7.35,0.48,- - - - 5 -,14.1,first snow flakes on 20181204
20181205,2019-46-YW-031,2018-12-04 15:00,2018-12-05 21:30,-21.87,0.2,-5.67,0.05,23.51,0.43,- - - - 5 -,4.7,NaN
20181206,2019-46-YW-032,2018-12-06 15:00,2018-12-07 15:00,-78.59,0.33,-10.25,0.07,3.38,0.68,- - - - - -,4.6,NaN
20181207,2019-46-YW-045,2018-12-07 15:00,2018-12-07 23:50,-129.05,0.2,-15.32,0.05,-6.46,0.44,- - - 4 5 -,2.8,NaN
20181208,2019-46-YW-046,2018-12-07 23:50,2018-12-09 19:00,-56.89,0.23,-8.08,0.05,7.74,0.49,- 2 - - 5 -,0.7,NaN
20181210,2019-46-YW-047,2018-12-09 19:00,2018-12-10 19:00,-44.46,0.2,-7.41,0.05,14.83,0.43,- - - - - -,1.8,NaN
20181222,2019-46-YW-048,2018-12-22 01:00,2018-12-22 19:00,-87.37,0.2,-12.05,0.05,9.07,0.46,- 2 - - 5 -,1.4,NaN
20181227,2019-46-YW-049,2018-12-24 04:00,2018-12-28 18:00,-38.19,0.2,-5.81,0.05,8.29,0.44,- - - - - -,36,NaN
20181229,2019-46-YW-050,2018-12-29 18:00,2018-12-30 17:00,-51.7,0.21,-7.38,0.05,7.33,0.44,- 2 - - 5 -,4.5,NaN
20181230,2019-46-YW-060,2018-12-30 17:00,2018-12-31 17:00,-19.23,0.21,-3.2,0.05,6.36,0.45,- 2 - - - -,20.4,NaN
20190115,2019-46-YW-061,2019-01-15 04:00,2019-01-15 22:00,-49.53,0.22,-8,0.05,14.49,0.46,- 2 - - 5 -,3,NaN
20190116,2019-46-YW-069,2019-01-16 12:00,2019-01-16 13:30,-50.24,0.36,-7.57,0.13,10.28,1.09,- - - - - -,3.4,totalizator
20190101,2019-46-YW-070,2018-12-31 17:00,2019-01-01 18:00,-21.35,0.21,-3.51,0.05,6.71,0.46,- - - - 5 -,7.8,NaN
20190103,2019-46-YW-071,2019-01-02 12:00,2019-01-03 21:00,-5.71,0.23,-3.6,0.05,23.11,0.48,- - - - 5 -,3.1,NaN
20190104,2019-46-YW-072,2019-01-03 21:00,2019-01-04 23:00,-25.9,0.21,-4.38,0.05,9.12,0.46,- - - - - -,21.8,NaN
20190105,2019-46-YW-073,2019-01-04 23:00,2019-01-05 18:00,-6.38,0.24,-1.39,0.06,4.73,0.54,- - - - - -,2.3,fog condensation below 1000 m
20190107,2019-46-YW-074,2019-01-05 18:00,2019-01-07 22:00,-40.89,0.2,-6.27,0.05,9.3,0.45,- - - - 5 -,14.6,NaN
20190110,2019-46-YW-075,2019-01-10 01:00,2019-01-11 19:00,-6.01,0.21,-2.12,0.05,10.95,0.47,- - - - - -,5.3,no precip on 20190111
20190112,2019-46-YW-076,2019-01-12 06:00,2019-01-12 19:00,-76.8,0.2,-10.06,0.05,3.72,0.46,- - - - - -,4.3,NaN
20190113,2019-46-YW-077,2019-01-12 19:00,2019-01-14 21:00,-76.48,0.2,-10.64,0.05,8.66,0.45,- - - - - -,11.7,there were ice the bottle and melted in room over night
20190118_S1,2019-46-YW-078,2019-01-18 02:00,2019-01-18 10:30,-39.42,0.22,-8.18,0.05,25.99,0.48,- - - - 5 -,5,rooftop snow and unit in cm
20190118_S2,2019-46-YW-079,2019-01-18 10:30,2019-01-18 14:30,-45.2,0.21,-8.55,0.05,23.23,0.48,- - - - 5 -,1,rooftop snow and unit in cm and emptied the totalizator
20190120,2019-46-YW-080,2019-01-19 01:00,2019-01-21 13:00,-48.69,0.23,-8.32,0.07,17.88,0.58,- - - - 5 -,13.7,unit in mm and most rain on 20190120 kl10-24
20190124,2019-46-YW-081,2019-01-24 01:00,2019-01-24 13:00,-138.23,0.21,-18.16,0.05,7.07,0.47,- - - 4 5 -,1.6,NaN
20190125,2019-46-YW-082,2019-01-25 15:00,2019-01-25 16:00,-100.07,0.21,-13.29,0.05,6.26,0.46,- - - - - -,NaN,snow from ground sample not found
20190204,2019-46-YW-083,2019-01-25 16:00,2019-02-04 16:00,-60.59,0.2,-9.64,0.05,16.51,0.45,- - - - - -,8.1,rain plus minus some snow
20190205,2019-46-YW-084,2019-02-04 16:00,2019-02-05 14:10,-102.92,0.21,-13.5,0.05,5.04,0.47,- - - - 5 -,2.5,rain
20190206,2019-46-YW-085,2019-02-05 14:10,2019-02-06 15:20,-67.1,0.2,-8.9,0.05,4.07,0.43,- - - - - -,2.2,rain
20190207,2019-46-YW-086,2019-02-06 15:20,2019-02-07 15:50,-38.46,0.2,-6.4,0.05,12.74,0.44,- - - - 5 -,2.8,rain
20190208,2019-46-YW-087,2019-02-07 15:50,2019-02-08 11:30,-127.3,0.21,-16.42,0.05,4.08,0.49,- - - - 5 -,3.6,rain
20190209,2019-46-YW-088,2019-02-08 11:30,2019-02-09 16:50,-93.13,0.2,-11.71,0.05,0.58,0.47,- - - - 5 -,4.8,rain
20190211,2019-46-YW-089,2019-02-09 16:50,2019-02-11 09:00,-118.5,0.22,-15.01,0.06,1.54,0.52,- - - - 5 -,2.6,rain
20190211_S1,2019-46-YW-090,2019-02-11 09:00,2019-02-11 09:05,-29.96,0.22,-6.81,0.06,24.49,0.5,- - - - 5 -,NaN,less than 1 mm snowfall with distinct vapour isotope peak
20190211_S2,2019-46-YW-091,2019-02-11 09:05,2019-02-11 09:40,-25.25,0.23,-5.85,0.06,21.55,0.52,- - - - 5 -,NaN,snowfall filtered
20190211_ALX,2019-46-YW-092,2019-02-11 09:00,2019-02-11 09:00,-26.98,0.27,-6.51,0.1,25.13,0.81,- - - - 5 -,NaN,snowfall collected from Alexandras garden filtered
20190212,2019-46-YW-093,2019-02-11 09:00,2019-02-12 14:50,     NaN,NaN,     NaN,     NaN,     NaN,     NaN,- - 3 - - -,5.8,rain
20190213,2019-46-YW-094,2019-02-12 14:50,2019-02-13 13:50,-39.82,0.2,-6.14,0.05,9.32,0.44,- - - - 5 -,9.2,rain
20190214,2019-46-YW-095,2019-02-13 13:50,2019-02-14 14:20,-10.55,0.23,-2.15,0.05,6.65,0.49,- - - - 5 -,2.1,rain
20190216,2019-46-YW-096,2019-02-16 08:00,2019-02-18 08:00,-27.84,0.22,-4.6,0.06,8.98,0.49,- 2 - - 5 -,5.6,rain
20190218,2019-46-YW-097,2019-02-18 18:00,2019-02-19 13:00,-41.14,0.2,-6.28,0.05,9.08,0.44,- - - - 5 -,13.5,rain
20190219,2019-46-YW-098,2019-02-19 13:00,2019-02-19 19:00,-28.95,0.2,-4.71,0.05,8.76,0.44,- 2 - - 5 -,2.7,rain
20190220,2019-46-YW-099,2019-02-20 15:00,2019-02-21 01:00,-59.02,0.27,-8.09,0.19,5.68,1.52,- 2 3 - 5 -,8.2,rain
20190221,2019-46-YW-100,2019-02-21 01:00,2019-02-21 10:30,-48.75,0.2,-6.46,0.05,2.93,0.43,- - - - 5 -,5.1,rain
20190222,2019-46-YW-101,2019-02-21 10:30,2019-02-22 03:00,-18.47,0.21,-2.64,0.05,2.65,0.45,- 2 - - - -,0.9,rain
20190225,2019-46-YW-102,2019-02-25 06:00,2019-02-25 20:00,-14.77,0.2,-2.6,0.05,6.01,0.44,- - - - 5 -,1.5,rain
20190227,2019-46-YW-103,2019-02-27 18:00,2019-02-28 06:00,-57.9,0.27,-8.36,0.04,9,0.44,- - - - - -,3.3,rain
20190303,2019-46-YW-104,2019-03-02 14:00,2019-03-03 14:00,-52.51,0.27,-7.75,0.04,9.5,0.44,- - - - - -,6.9,rain
20190304,2019-46-YW-105,2019-03-03 14:00,2019-03-08 19:00,-59.74,0.26,-8.56,0.04,8.71,0.43,- - - - - -,30.5,rain 5 days
20190309,2019-46-YW-106,2019-03-08 22:00,2019-03-09 19:00,-77.74,0.26,-11.52,0.04,14.4,0.42,- - - - 5 -,6.5,rain
20190312,2019-46-YW-107,2019-03-12 01:00,2019-03-12 21:00,-98.31,0.27,-13.17,0.04,7.02,0.43,- - - - - -,8.8,rain
20190315,2019-46-YW-108,2019-03-12 21:00,2019-03-15 15:30,-52.4,0.26,-8.2,0.04,13.19,0.41,- - - - - -,13.9,rain 3 days
20190316,2019-46-YW-109,2019-03-15 15:30,2019-03-16 12:00,-84.95,0.26,-11.84,0.04,9.75,0.42,- - - - - -,6.5,rain
20190317,2019-46-YW-110,2019-03-16 12:00,2019-03-17 08:00,-67.37,0.26,-9.39,0.04,7.79,0.43,- - - - 5 -,3,rain sampled 20190318 klokken 12
20190319,2019-46-YW-111,2019-03-19 18:00,2019-03-20 17:00,-45.44,0.28,-6.89,0.04,9.64,0.44,- - - - - -,9.8,rain
20190321,2019-46-YW-112,2019-03-20 17:00,2019-03-21 11:00,-32.25,0.27,-4.55,0.04,4.17,0.42,- - - - - -,27.9,rain
20190322,2019-46-YW-113,2019-03-22 11:00,2019-03-22 17:00,-13.66,0.27,-2.17,0.04,3.67,0.44,- - - - - -,2.3,rain
20190323,2019-46-YW-114,2019-03-22 17:00,2019-03-25 05:00,-52.01,0.26,-8.01,0.04,12.07,0.43,- - - - - -,33.6,rain Showers on 20190323 and heavy rain on 20190324
20190324_ALX_S1,2019-46-YW-115,2019-03-24 17:25,2019-03-24 17:55,-96.64,0.26,-13.34,0.04,10.08,0.43,- - - - - -,NaN,snowfall collected from Alexandras garden filtered
20190324_ALX_S2,2019-46-YW-116,2019-03-24 19:00,2019-03-24 19:55,-99.45,0.28,-13.76,0.04,10.62,0.43,- - - - 5 -,NaN,snowfall collected from Alexandras garden filtered
20190326,2019-46-YW-117,2019-03-26 10:00,2019-03-26 22:00,-44.46,0.26,-6.39,0.04,6.67,0.42,- - - - 5 -,12.2,rain
20190328,2019-46-YW-118,2019-03-27 15:00,2019-03-28 16:00,-12.49,0.27,-2.04,0.04,3.81,0.42,- - - - 5 -,7,rain
20190329,2019-46-YW-119,2019-03-29 12:00,2019-03-29 21:00,-1.48,0.28,-0.89,0.04,5.63,0.43,- - - - - -,3.2,rain
20190330,2019-46-YW-120,2019-03-29 21:00,2019-03-31 21:00,-29.01,0.28,-5.69,0.04,16.5,0.43,- - - - 5 -,11,rain
20190424,2019-46-YW-121,2019-04-24 23:00,2019-04-25 01:00,-32.69,0.27,-2.85,0.04,-9.86,0.45,- 2 - - - -,0.7,rain shower after a 24 days dry period
20190425,2019-46-YW-122,2019-04-25 17:00,2019-04-25 20:00,-16.32,0.25,-2.12,0.04,0.63,0.41,- - - - - -,1.2,rain shower 
20190426,2019-46-YW-123,2019-04-26 10:00,2019-04-26 16:00,-17.89,0.28,0.16,0.04,-19.16,0.43,- - - - 5 -,0.1,light rain
20190427,2019-46-YW-124,2019-04-27 14:00,2019-04-28 11:00,-49.42,0.27,-7.27,0.04,8.76,0.43,- - - - - -,7,rain
20190501,2019-46-YW-125,2019-05-01 20:00,2019-05-02 04:00,-18.16,0.26,-3.39,0.04,8.97,0.42,- - - - - -,1.3,rain
20190503,2019-46-YW-126,2019-05-02 20:00,2019-05-03 09:00,-34.37,0.25,-7.03,0.04,21.9,0.42,- 2 - - 5 -,1.7,rain
20190505,2019-46-YW-127,2019-05-05 02:00,2019-05-05 23:00,-33.29,0.26,-5.83,0.04,13.34,0.42,- 2 - - - -,2.4,rain
20190506,2019-46-YW-128,2019-05-06 16:00,2019-05-06 20:00,-60.82,0.32,-8.95,0.05,10.78,0.52,- - - - 5 -,1,graupel showers
20190508,2019-46-YW-129,2019-05-08 10:00,2019-05-08 14:00,-37.28,0.26,-6.89,0.04,17.87,0.41,- - - - - -,1,rain plus snow
20190509,2019-46-YW-130,2019-05-09 12:00,2019-05-09 22:45,-77.26,0.26,-9.25,0.04,-3.23,0.42,- - - - 5 -,0.6,light rain
20190510,2019-46-YW-131,2019-05-09 22:45,2019-05-10 15:00,-115.65,0.27,-15.61,0.04,9.21,0.44,- - - - - -,4,light rain
20190513,2019-46-YW-132,2019-05-12 18:00,2019-05-13 03:00,-20.11,0.27,-4.61,0.04,16.76,0.44,- - - - - -,0.8,two light showers
20190520,2019-46-YW-133,2019-05-20 18:50,2019-05-20 20:20,-39.08,0.27,-2.4,0.04,-19.91,0.43,- - - - 5 -,0.8,one hour shower after a dry week
20190522,2019-46-YW-134,2019-05-21 22:00,2019-05-23 10:00,-39.55,0.26,-6.14,0.04,9.59,0.41,- - - - 5 -,15.4,rain
20190523,2019-46-YW-135,2019-05-23 12:00,2019-05-24 02:00,-100.93,0.27,-13.12,0.04,4.01,0.44,- - - - - -,14.8,rain
20190525,2019-46-YW-136,2019-05-25 13:00,2019-05-25 20:00,-38.6,0.29,-5.88,0.05,8.44,0.47,- - - - - -,4.8,rain
20190526,2019-46-YW-137,2019-05-26 01:00,2019-05-25 05:00,-20.36,0.27,-4.49,0.04,15.53,0.43,- - - - - -,0.3,rain
20190529,2019-46-YW-138,2019-05-28 11:00,2019-05-29 20:30,-38.99,0.26,-7.13,0.04,18.03,0.43,- - - - - -,5,rain small showers
20190530,2019-46-YW-139,2019-05-29 20:30,2019-05-30 13:00,-50.96,0.26,-8.16,0.04,14.35,0.43,- - - - 5 -,9.9,rain
20190531,2019-46-YW-140,2019-05-30 22:00,2019-05-31 12:00,-27.3,0.28,-4.83,0.04,11.31,0.45,- - - - 5 -,2.2,rain
20190601,2019-46-YW-141,2019-05-31 23:00,2019-06-01 13:00,-76.89,0.27,-9.99,0.04,3.02,0.45,- 2 - - 5 -,18.5,rain
20190602,2019-46-YW-142,2019-06-01 23:00,2019-06-03 01:20,-26.45,0.28,-4.03,0.04,5.77,0.43,- - - - 5 -,10.3,rain
20190603,2019-46-YW -143,2019-06-03 01:20,2019-06-03 08:00,-27.68,0.28,-4.52,0.04,8.47,0.43,- - - - - -,8.2,rain
20190605,2019-46-YW -144,2019-06-05 07:00,2019-06-05 12:00,-59.3,0.27,-7.59,0.04,1.45,0.44,- - - - - -,2.5,rain
20190606_R1,2019-46-YW -145,2019-06-06 10:00,2019-06-06 14:30,-31.25,0.26,-4.02,0.04,0.91,0.42,- - - - - -,1.4,thunderstorm
20190606_R2,2019-46-YW -146,2019-06-06 16:30,2019-06-06 20:30,-34.67,0.26,-5.23,0.04,7.15,0.42,- - - - - -,3.2,thunderstorm
20190608,2019-46-YW -147,2019-06-08 09:00,2019-06-08 20:00,-39.89,0.26,-4.31,0.04,-5.4,0.43,- - - - 5 -,2.5,rain shower
20190609,2019-46-YW -148,2019-06-09 00:00,2019-06-10 18:00,-54.8,0.27,-7.63,0.04,6.23,0.42,- - - - 5 -,19.5,rain
20190613,2019-46-YW -149,2019-06-13 03:00,2019-06-13 14:00,-40.02,0.28,-6.08,0.04,8.65,0.43,- - - - - -,4.7,rain
20190614,2019-46-YW -150,2019-06-14 16:00,2019-06-14 21:00,-35.17,0.26,-4.77,0.04,3.01,0.4,- - - - - -,0.9,rain
20190616,2019-46-YW -151,2019-06-15 20:00,2019-06-17 13:30,-20.34,0.29,-3.39,0.04,6.79,0.46,- - - - 5 -,6,rain
20190617,2019-46-YW -152,2019-06-17 13:30,2019-06-17 23:30,-10.92,0.28,-1.75,0.04,3.07,0.45,- - - - 5 -,1.6,rain
20190621,2019-46-YW -153,2019-06-21 04:00,2019-06-22 00:40,-44.48,0.27,-6.07,0.04,4.1,0.44,- - - - - -,9.6,rain
20190622,2019-46-YW -154,2019-06-22 00:40,2019-06-22 15:00,-40.93,0.27,-5.82,0.04,5.63,0.42,- - - - 5 -,2.3,rain
20190624,2019-46-YW -155,2019-06-24 16:00,2019-06-24 24:00,-37.3,0.26,-5.23,0.04,4.55,0.41,- - - - - -,6.3,rain first part
20190625,2019-46-YW -156,2019-06-25 00:00,2019-06-25 14:00,-56.03,0.28,-8.62,0.04,12.91,0.43,- - - - - -,21,rain second part
20190630,2019-46-YW -157,2019-06-30 02:00,2019-06-30 22:00,-17.08,0.28,-2.28,0.04,1.18,0.42,- 2 - - - -,1.8,rain
20190701,2019-46-YW -158,2019-06-30 22:00,2019-07-02 19:20,-32.78,0.27,-4.97,0.04,6.94,0.42,- - - - - -,27.7,rain
20190702,2019-46-YW -159,2019-07-02 19:20,2019-07-02 23:50,-57.84,0.29,-8.89,0.05,13.29,0.47,- - - - 5 -,5.5,heavy showers
20190703,2019-46-YW -160,2019-07-02 23:50,2019-07-03 23:00,-41.85,0.27,-6.59,0.04,10.86,0.42,- - - - - -,4.4,rain showers
20190704,2019-46-YW -161,2019-07-04 01:00,2019-07-04 12:00,-38.5,0.26,-5.66,0.04,6.75,0.42,- - - - - -,5.1,rain
20190706,2019-46-YW -162,2019-07-06 05:00,2019-07-07 17:00,-79.44,0.27,-10.69,0.04,6.05,0.43,- - - - 5 -,9.5,rain 24 hour dry period in between
20190720,2019-46-YW -163,2019-07-20 11:00,2019-07-21 17:00,-58.9,0.27,-7.7,0.04,2.74,0.44,- 2 - - - -,24.4,rain after 2 weeks dry period
20190722,2019-46-YW -164,2019-07-22 18:00,2019-07-23 13:00,-31.08,0.26,-4.15,0.04,2.11,0.42,- - - - - -,2.4,fog condensation below 2000 m
20190728,2019-46-YW -165,2019-07-28 22:40,2019-07-29 02:00,-33.09,0.29,-2.07,0.04,-16.55,0.46,- - - - 5 -,0.3,Shower and thunder
20190731,2019-46-YW -166,2019-07-30 18:00,2019-07-31 22:00,-58.68,0.26,-8.59,0.04,10.02,0.43,- - - - - -,36.6,heavy rain
20190806,2019-46-YW -167,2019-08-06 11:00,2019-08-07 05:00,-39.19,0.27,-5.86,0.04,7.66,0.42,- - - - - -,23.3,heavy rain
20190810,2019-46-YW -168,2019-08-09 22:00,2019-08-10 23:50,-75.25,0.26,-9.56,0.04,1.22,0.41,- 2 - - - -,20.6,heavy rain
20190811,2019-46-YW -169,2019-08-11 01:00,2019-08-12 23:50,-49.99,0.27,-7.04,0.04,6.36,0.43,- - - - - -,49.8,heavy rain
20190813,2019-46-YW -170,2019-08-13 01:00,2019-08-13 18:00,-46.65,0.29,-7.42,0.05,12.68,0.47,- 2 - - 5 -,3.1,rain
20190814,2019-46-YW -171,2019-08-14 07:00,2019-08-14 22:00,-44.85,0.27,-7.46,0.04,14.83,0.44,- - - - - -,8,rain shower
20190815,2019-46-YW -172,2019-08-15 22:00,2019-08-16 03:30,-65.75,0.27,-9.48,0.04,10.09,0.43,- - - - 5 -,10.3,rain
20190816,2019-46-YW -173,2019-08-16 19:00,2019-08-19 15:00,-61.41,0.27,-8.43,0.04,6.01,0.41,- - - - 5 -,32.5,many showers throughout the weekend
20190819,2019-46-YW -174,2019-08-19 22:30,2019-08-20 13:00,-61.3,0.27,-8.57,0.04,7.28,0.43,- - - - - -,13,rain showers
20190820,2019-46-YW -175,2019-08-19 20:00,2019-08-20 22:50,-30.38,0.27,-4.8,0.04,8.02,0.42,- - - - - -,2.9,rain
20190822,2019-46-YW -176,2019-08-22 04:00,2019-08-22 13:00,-88.19,0.27,-11.92,0.04,7.14,0.42,- - - - - -,10.5,heavy rain in the morning
20190823_R1,2019-46-YW -177,2019-08-23 02:00,2019-08-23 04:00,-50.58,0.26,-7.57,0.04,9.97,0.41,- - - - 5 -,9,rain
20190823_R2,2019-46-YW -178,2019-08-23 16:00,2019-08-23 22:00,-58.74,0.26,-8.01,0.04,5.37,0.43,- - - - 5 -,3.6,rain
20190824,2019-46-YW -179,2019-08-23 22:00,2019-08-24 22:00,-25.82,0.28,-4.13,0.04,7.25,0.42,- - - - - -,2.2,rain short showers
20190828,2019-46-YW -180,2019-08-28 05:30,2019-08-28 18:35,-36.72,0.27,-5.82,0.04,9.88,0.42,- - - - 5 -,6.1,very heavy rain showers kl0600_0700 kl1800_1835
20190829_R1,2019-46-YW -181,2019-08-28 18:35,2019-08-29 14:00,-38.91,0.26,-6.33,0.04,11.72,0.41,- - - - - -,25.2,very heavy rain showers
20190829_R2,2019-46-YW -182,2019-08-29 21:00,2019-08-30 00:50,-24.71,0.26,-4.88,0.04,14.33,0.41,- 2 - - - -,8.4,heavy rain shower
20190830_R1,2019-46-YW -183,2019-08-30 00:50,2019-08-30 15:00,-35.36,0.26,-5.82,0.04,11.2,0.41,- - - - 5 -,21.5,heavy rain
20190830_R2,2019-46-YW -184,2019-08-30 15:00,2019-08-30 23:00,-20.17,0.27,-3.65,0.04,9.06,0.42,- - - - - -,15.5,rain
20190831_R1,2019-46-YW -185,2019-08-30 23:00,2019-08-31 10:00,-25.06,0.27,-3.94,0.04,6.43,0.41,- - - - - -,10.9,rain
20190831_R2,2019-46-YW -186,2019-08-31 22:00,2019-09-01 14:00,-49.54,0.3,-7.4,0.05,9.65,0.47,- - - - - -,6.8,rain showers
20190902,2019-46-YW -187,2019-09-02 22:00,2019-09-03 06:00,-65.17,0.28,-9.31,0.04,9.3,0.44,- - - - - -,7.5,rain
20190904_R1,2019-46-YW -188,2019-09-04 06:00,2019-09-04 20:00,-77.89,0.26,-10.73,0.04,7.99,0.42,- - - - 5 -,28.7,rain
20190904_R2,2019-46-YW -189,2019-09-04 20:00,2019-09-05 17:40,-53.45,0.25,-8.31,0.04,13,0.4,- - - - - -,12.5,rain
20190906,2019-46-YW -190,2019-09-06 00:00,2019-09-07 02:00,-73.67,0.26,-10.22,0.04,8.1,0.43,- - - - 5 -,5.2,3 rain events (6.9. 0:00-6:10 an 17:00-19:00 and 7.9. 0:00-2:00)
20190911_R1,2019-46-YW -191,2019-09-11 04:00,2019-09-11 19:20,-48.2,0.27,-7.15,0.04,8.97,0.43,- - - - - -,11,rain
20190911_R2,2019-46-YW -192,2019-09-11 20:30,2019-09-12 17:00,-24.1,0.26,-3.64,0.04,5.02,0.41,- 2 - - - -,6.1,rain
20190912,2019-46-YW -193,2019-09-12 17:00,2019-09-13 14:00,-39.76,0.27,-6.21,0.04,9.95,0.42,- - - - 5 -,17,heavy rain showers
20190914,2019-46-YW -194,2019-09-13 14:00,2019-09-15 19:20,-40.26,0.26,-6.68,0.04,13.19,0.42,- - - - - -,60.2,heavy rain 1 litre bottle is full
20190915,2019-46-YW -195,2019-09-15 20:50,2019-09-16 17:10,-42.92,0.26,-6.73,0.04,10.94,0.42,- - - - - -,4.5,rain
20190917,2019-46-YW -196,2019-09-16 17:10,2019-09-19 20:00,-43.1,0.3,-7.37,0.05,15.9,0.47,- - - - 5 -,20,rain
20190920,2019-46-YW -197,2019-09-20 00:00,2019-09-20 16:00,-18.52,0.26,-3.57,0.04,10.08,0.41,- - - - - -,3.3,drizzle
20190930_R1,2019-46-YW -198,2019-09-30 13:30,2019-09-30 20:50,-77.8,0.26,-10.78,0.04,8.42,0.42,- - - - - -,7.8,rain after longer dry period
20190930_R2,2019-46-YW -199,2019-09-30 20:50,2019-10-01 22:10,-55.78,0.25,-8.97,0.04,16.01,0.41,- - - - - -,16.2,rain
20191007,2019-46-YW -200,2019-10-07 21:20,2019-10-08 07:45,-94.01,0.26,-12.48,0.04,5.8,0.42,- - - - - -,2.7,first rain after dry period
20191008,2019-46-YW -201,2019-10-08 16:10,2019-10-09 08:30,-54.8,0.26,-7.47,0.04,4.98,0.42,- - - - - -,1.2,rain showers
20191009,2019-46-YW -202,2019-10-09 12:30,2019-10-10 17:40,-50.72,0.3,-7.4,0.04,8.46,0.46,- - - - 5 -,20,rain
20191010,2019-46-YW-203,2019-10-10 17:40,2019-10-11 14:30,-52.07,0.27,-7.53,0.05,8.17,0.45,- - - - - -,12.1,rain
20191011,2019-46-YW-204,2019-10-11 14:30,2019-10-15 16:30,-60.62,0.3,-8.85,0.05,10.2,0.48,- - - - - -,35.5,5 events all along the weekend
20191015,2019-46-YW-205,2019-10-15 23:50,2019-10-16 14:00,-56.4,0.26,-7.08,0.04,0.27,0.43,- 2 - - - -,0.8,rain
20191017_R1,2019-46-YW-206,2019-10-17 05:30,2019-10-17 16:00,-89.85,0.27,-10.93,0.04,-2.41,0.44,- 2 - - 5 -,2.5,rain
20191017_R2,2019-46-YW-207,2019-10-17 18:50,2019-10-18 04:00,-33.34,0.26,-5.45,0.04,10.28,0.42,- - - - - -,5,rain
20191022_R1,2019-46-YW-208,2019-10-22 02:30,2019-10-22 18:40,-32.01,0.27,-5.48,0.04,11.82,0.42,- - - - - -,32.3,rain
20191022_R2,2019-46-YW-209,2019-10-22 18:40,2019-10-23 17:00,-17.02,0.3,-3.47,0.04,10.76,0.46,- - - - - -,18.8,rain
20191024,2019-46-YW-210,2019-10-24 16:20,2019-10-25 04:00,-66.17,0.27,-9.8,0.04,12.24,0.45,- 2 - - 5 -,27.5,rain
20191025,2019-46-YW-211,2019-10-25 12:30,2019-10-26 15:10,-50.33,0.3,-8.76,0.05,19.73,0.5,- - - - 5 -,9.4,rain showers
20191026,2019-46-YW-212,2019-10-26 22:40,2019-10-27 03:50,-43.7,0.27,-7.72,0.04,18.1,0.44,- - - - 5 -,3.7,rain
20191030_R1,2019-46-YW-213,2019-10-30 03:00,2019-10-30 19:10,-26.9,0.27,-5.95,0.04,20.67,0.42,- 2 - - - -,5.6,rain
20191030_R2,2019-46-YW-214,2019-10-30 19:10,2019-10-31 15:30,-24.49,0.28,-5.53,0.04,19.79,0.43,- 2 - - 5 -,8,rain showers
20191106,2019-46-YW-215,2019-11-06 04:00,2019-11-07 08:00,-34.23,0.28,-7.36,0.05,24.63,0.47,- - - - 5 -,4.3,rain
20191113,2019-46-YW-216,2019-11-12 10:00,2019-11-13 13:00,-88.6,0.27,-12.94,0.04,14.91,0.43,- 2 - - 5 -,24.6,rain
20191122,2019-46-YW-217,2019-11-22 15:00,2019-11-23 04:00,-92.54,0.26,-10.29,0.04,-10.2,0.42,- 2 - - - -,0.4,rain
20191126,2019-46-YW-218,2019-11-26 03:00,2019-11-26 17:00,-66.58,0.27,-8.93,0.04,4.82,0.43,- - - - - -,0.6,rain
20191129,2019-46-YW-219,2019-11-29 08:00,2019-11-30 05:00,-24.43,0.27,-6.14,0.04,24.66,0.43,- - - - - -,3.9,rain
20191201,2019-46-YW-220,2019-12-01 03:00,2019-12-02 13:00,-40.13,0.26,-7.93,0.04,23.34,0.42,- - - - - -,13.3,rain and wet snow
20191203_T1,2019-46-YW-221,2019-12-03 03:00,2019-12-03 04:00,-79.01,0.25,-11.06,0.04,9.5,0.42,- 2 - - 5 -,0.6,rain
20191203_T2,2019-46-YW-222,2019-12-03 04:00,2019-12-03 04:30,-83.93,0.27,-11.5,0.04,8.04,0.43,- 2 - - - -,NaN,rain 2 ml 
