Add support to fetch partial arbeidsordre

4 jobs for support-partial-arbeidsordre in 2 minutes and 5 seconds (queued for 2 seconds)
latest
Name Stage Failure
failed
linters Test
         accounting_period: str = None,
would reformat ubw_client/client.py
Oh no! 💥 💔 💥
2 files would be reformatted, 7 files would be left unchanged.
ERROR: InvocationError for command /builds/it-bott-integrasjoner/ubw-client/.tox/linters/bin/black --check --diff ubw_client tests setup.py (exited with code 1)
___________________________________ summary ____________________________________
ERROR: linters: commands failed
Cleaning up file based variables
ERROR: Job failed: exit code 1
failed
python36 Test
-- Docs: https://docs.pytest.org/en/stable/warnings.html
=========================== short test summary info ============================
FAILED tests/test_model.py::test_bruker - AssertionError: assert None
============= 1 failed, 56 passed, 27 skipped, 1 warning in 0.57s ==============
ERROR: InvocationError for command /builds/it-bott-integrasjoner/ubw-client/.tox/py36/bin/coverage run --branch --source=ubw_client -m pytest (exited with code 1)
___________________________________ summary ____________________________________
ERROR: py36: commands failed
Cleaning up file based variables
ERROR: Job failed: exit code 1
failed
python37 Test
-- Docs: https://docs.pytest.org/en/stable/warnings.html
=========================== short test summary info ============================
FAILED tests/test_model.py::test_bruker - AssertionError: assert None
============= 1 failed, 56 passed, 27 skipped, 1 warning in 0.48s ==============
ERROR: InvocationError for command /builds/it-bott-integrasjoner/ubw-client/.tox/py37/bin/coverage run --branch --source=ubw_client -m pytest (exited with code 1)
___________________________________ summary ____________________________________
ERROR: py37: commands failed
Cleaning up file based variables
ERROR: Job failed: exit code 1
failed
python38 Test
ERROR: InvocationError for command /builds/it-bott-integrasjoner/ubw-client/.tox/py38/bin/coverage run --branch --source=ubw_client -m pytest (exited with code 1)
___________________________________ summary ____________________________________
ERROR: py38: commands failed
Uploading artifacts for failed job
Uploading artifacts...
WARNING: coverage.xml: no matching files
ERROR: No files to upload
Cleaning up file based variables
ERROR: Job failed: exit code 1