430,450,430,410
430,410,460,410
460,410,460,390
460,390,410,390
410,390,410,450
190,450,190,390
190,390,140,390
140,390,140,410
140,410,170,410
170,410,170,450
10,450,10,320
10,320,50,320
50,320,50,300
50,300,10,300
10,300,10,0
90,130,50,130
50,130,50,110
50,110,90,110
90,110,90,130
460,320,410,320
410,320,410,300
410,300,460,300
460,300,460,320
590,450,590,230
590,230,550,230
550,230,550,200
550,200,590,200
590,200,590,0
400,130,360,130
360,130,360,110
360,110,400,110
400,110,400,130
320,110,280,110
280,110,280,90
280,90,320,90
320,90,320,110
240,70,240,90
240,90,200,90
200,90,200,70
200,70,240,70
190,0,190,20
190,20,410,20
410,20,410,0
