110,450,110,430
110,430,30,430
30,430,30,320
30,320,90,320
90,320,90,230
90,230,310,230
310,230,310,180
310,180,40,180
40,180,40,80
40,80,10,80
10,80,10,0
110,0,110,110
110,110,310,110
310,110,310,30
310,30,280,0
190,450,190,300
190,300,310,300
310,300,310,340
310,340,370,400
370,400,370,450
480,450,480,400
480,400,540,340
540,340,540,280
540,280,590,280
590,280,590,110
590,110,540,110
540,110,540,0
