590,450,590,240
590,240,540,240
540,240,540,210
540,210,590,210
590,210,590,0
520,450,520,390
520,390,490,390
490,390,470,410
470,410,500,410
500,410,500,440
500,440,470,440
470,440,460,450
200,450,140,390
140,390,140,360
140,360,150,360
150,360,110,320
110,320,10,320
10,320,10,20
10,20,50,20
50,20,50,0
150,230,70,230
70,230,70,200
70,200,120,200
120,200,150,230
390,310,300,310
300,310,300,280
300,280,390,280
390,280,390,310
220,100,160,100
160,100,160,70
160,70,220,70
220,70,220,100
130,0,130,20
130,20,190,20
190,20,190,0
270,0,270,20
270,20,330,20
330,20,330,0
410,0,410,20
410,20,470,20
470,20,470,0
