2647710972,
2701692528,
2574254200,
3243709236,
3318336552,
2357308184,
2079576906,
2486283904,
4353978054,
4474230921,
1887803128,
1749682935,
2451591331,
1835698085,
1936920097,
1705310185,
1991714482,
2187179052,
1853548278,
1684124747,
1995134134,
2114334952,
2139108864,
1758108191,
1445360300,
1768099132,
1867377882,
3047473357,
2439820636,
1917824742,
1881350547,
1836033989,
2022063795,
2293065465,
1805378139,
2240668083,
2410100781,
2330787085,
2119539381,
1724384427,
2132329747,
1728631117,
3747861312,
1909753073,
3223078456,
1731348979,
2293075498,
1985687180,
2589951845,
1872422509,
1787438279,
2209037846,
1804458106,
2351400559,
2334782641,
2665763133,
1902359546,
1809585503,
2095040445,
1882121039,
1873720638,
4113371598,
1066353867,
4202690158,
1062383477,
1886674486,
1973905017,
1853705409,
2270162361,
1798608042,
2194199781,
1936260873,
4102235433,
3240444344,
2055629364,
1845585766,
1758808079,
2003539181,
1840232517,
1710509851,
2045480356,
1809312754,
2050741857,
1801064335,
1768037654,
2250366379,
1727099269,
2035742361,
2485330442,
4797913376,
2102383358,
1749542414,
2232518198,
1801385318,
1941343781,
1174892097,
1879837092,
2557984804,
2146287727,
1988369502,
