3282726586,
4428426240,
2796944100,
2613128085,
6571549232,
2383002087,
2255190580,
3808001859,
8727235213,
4882633595,
2242079680,
3258199181,
2691916113,
2238980182,
3052034099,
2229375741,
2916089205,
2432926072,
2270037879,
2177947216,
2709077000,
2561940314,
2841798446,
2176113949,
2288195402,
2179368315,
2181553179,
3615660937,
2901287699,
2487907661,
2293727332,
2335322885,
2506764023,
3106886903,
2213754494,
2262981144,
3276593335,
2583706382,
3109357382,
2229289959,
2823302040,
2236675833,
4155379444,
2399813503,
3178807626,
2205775569,
2964955571,
2727406696,
2918867692,
2253860063,
2264451359,
2820888588,
2219994933,
2706445312,
2127305265,
2720901255,
2224930168,
2226588878,
2745318396,
2230073204,
2221979563,
2305389390,
2669749786,
3095866235,
2679505263,
2217417366,
2227072465,
2237466750,
2823190028,
2218770535,
2782815364,
2283320667,
2295151153,
2749192711,
2717231387,
2251077396,
2371465902,
2641106659,
2217597662,
2227975093,
2699909508,
2333766395,
2760231830,
2203904990,
2196312175,
2813153779,
2275350664,
2751635092,
3551306272,
2604218253,
2834641901,
2342106248,
2709131864,
2302741147,
2310977454,
4132826761,
2330860467,
3262788305,
2774999922,
2691128788,
