217779654,
127412535,
85605748,
82312178,
132222213,
75262455,
77147911,
82361050,
127027535,
103540019,
105483052,
154857320,
118467234,
89629208,
77543991,
75192647,
72516870,
75052521,
73457757,
73372297,
76279182,
75226875,
75431220,
78978922,
71876731,
74024706,
73451036,
73456796,
122655219,
78059452,
73318681,
81119382,
74607555,
73995934,
79384406,
73846449,
74634652,
75399783,
76307853,
80771380,
73816172,
80469193,
74455047,
73572134,
77263542,
72236968,
71256891,
79092369,
72629849,
73849040,
72487692,
76146149,
73670976,
77699169,
75520402,
71804647,
74487539,
78703227,
74496331,
72495625,
74530202,
72777487,
77120774,
76697387,
71848241,
158905363,
82185080,
98145610,
74284894,
75409146,
75071766,
75236503,
78861742,
163718241,
77498469,
76199494,
71565046,
71387495,
74224883,
78516611,
75450734,
74119455,
72683240,
73380331,
72522220,
82763984,
75385332,
79152229,
74764462,
81587014,
74239867,
71026462,
74829741,
81050826,
75356142,
74446203,
72519674,
76415778,
73041174,
79831136,
