195993028,
73353161,
47776312,
42786860,
76705041,
39048665,
51193570,
45741388,
75117394,
73678607,
65615132,
119736256,
69653386,
39824365,
41463126,
37871017,
34474593,
41184876,
38261322,
36960358,
34610992,
37910238,
38588243,
37910310,
36292056,
40149388,
34574661,
39905878,
190911404,
38246971,
37362427,
42119931,
37991149,
37744139,
37223259,
40965969,
34590092,
40378385,
38080251,
40226378,
35553043,
35736281,
39114375,
37382443,
35642593,
35164255,
33736035,
35279121,
36891639,
33225831,
37272280,
41754942,
35682479,
39441540,
37563134,
36769089,
37893569,
38300192,
37086329,
36215665,
36643274,
34501600,
37449422,
39516130,
38114607,
65076773,
38745601,
55719425,
37746790,
36083609,
34273273,
38512935,
38831305,
56730007,
37559090,
37030227,
36091822,
36791625,
34730332,
36521245,
36972728,
36853790,
39082252,
39132166,
36717667,
43916302,
36483472,
39870260,
37059477,
39873117,
34075004,
36181226,
37152561,
40668891,
38092589,
36455042,
36875462,
38111014,
41038101,
36883279,
