4315983528,
896233497,
2558625953,
1093638844,
2097864410,
1029650221,
2374944068,
1122795125,
2895988266,
1081888619,
2617762749,
1010728841,
1714245438,
3121172569,
774646792,
2190217225,
840369964,
2261720219,
840421206,
2501759389,
691782448,
2216855982,
726599607,
2559505859,
776721453,
1901773852,
1052627303,
2467813024,
678535937,
2910634208,
709902139,
2448485099,
1001168290,
2029780623,
711316907,
2376218538,
1077872241,
1922317968,
982622502,
1897925745,
2088697056,
2045900238,
862393381,
2915991107,
1069941684,
785797268,
2407506705,
941941797,
2474738393,
749449018,
2077562836,
719117528,
2642539961,
1000483188,
2139294906,
832585917,
2751884625,
935543893,
2611333194,
885446231,
2235805304,
764341722,
2037584807,
826955190,
2167910725,
784167765,
2478606606,
761124085,
2674360236,
999757049,
877585740,
2416868299,
868538793,
2835385052,
845448705,
2329796944,
903334700,
2747433543,
691940302,
2693845233,
866531317,
2794425672,
754351749,
2601766292,
733731808,
842207902,
2729921819,
726228457,
2042052295,
889394245,
2085618973,
785548817,
2042724270,
680136054,
1974570899,
679907318,
2010480291,
684264310,
2954858378,
705173814,
