﻿lat;lon
65.17344;-168.69068
66.62991;-168.68744
67.66994;-168.96004
67.78301;-168.602
67.897935;-168.23502
68.01303;-167.86692
68.12802;-167.4951
68.24202;-167.12202
69.16661;-168.66658
70.5;-168.66672
71.43002;-168.66666
71.89503;-168.66665
72.36003;-168.66662
72.82501;-168.6668
73.35001;-166.69994
73.88883;-168.19913
74.34464;-168.04954
74.8006;-167.89828
75.0206;-169.93648
76.99919;-170.05488
76.975015;-174.94906
77.16665;-179.67034
78.64942;173.0117
78.01188;173.14586
76.21683;175.27581
75.97743;173.55122
75.05103;173.51816
74.66276;172.39415
74.36327;171.22252
74.02762;169.97676
74.69101;174.65418
75.39292;175.38784
75.802;177.07916
75.08454;176.8033
75.10361;178.38568
75.19223;179.90866
75.14643;-177.95532
75.14681;-176.02999
75.18699;-173.99974
75.23914;-172.01564
75.45012;-171.06222
75.51231;-171.24222
75.99357;-170.44038
76.51341;-171.16918
75.24591;-167.26824
75.69123;-166.63812
76.13434;-165.48534
76.57753;-164.33258
77.02771;-164.21682
77.46872;-164.21754
76.54274;-159.94114
76.33204;-156.24206
75.91133;-158.75858
75.49514;-161.17188
74.51425;-162.14836
73.92944;-164.44054
73.35302;-166.6885
