﻿lat;lon
46.8795;159.785
71.59184;205.18683
71.6765;205.04634
71.73734;204.83284
71.805;204.69533
71.81966;204.30901
71.83017;203.961
71.90884;203.953
72.10233;204.08917
72.47334;204.42117
74.5245;198.07817
73.02483;200.31084
72.46433;200.32817
72.599;199.16566
72.72317;202.08733
73.29684;203.1875
73.39883;201.286
73.1615;205.31483
72.72234;204.86667
71.8095;206.74117
72.018;205.35201
72.45934;203.0155
72.02383;201.47816
72.05367;198.6255
71.52184;197.54233
71.02883;198.802
71.43716;195.05099
71.75383;196.60916
71.76334;193.63916
72.0035;191.24567
72.0655;192.10049
71.5015;191.25467
70.99983;193.355
71.00017;191.25133
70.50733;191.25383
69.99934;191.26233
70.001;193.31334
70;195.53551
69.35367;193.77684
69.428;192.54866
69.4975;191.26184
69.00134;191.24834
68.802;193.03233
68.5025;191.25133
68.035;191.1675
67.50283;191.245
67.74733;191.49333
67.8745;191.74451
67.99834;191.99283
68.09617;192.3255
68.196;192.65849
68.24733;192.79016
68.2955;192.93649
67.60133;193.49966
67.0435;192.84666
67.002;191.23033
66.49934;191.24933
65.99783;191.2515
65.50383;191.259
65.094;190.48033
64.72667;189.58051
64.31467;188.6965
