﻿lat;lon
81.8026633833333;30.88455875
82.47032195;29.5358782166667
82.9468593;27.9102854166667
83.3820570666667;26.8780479333333
83.8994248833333;25.4113657166667
84.1782453166667;22.08964075
84.4959923166667;17.9159069833333
84.8254379833333;12.3425969333333
85.3707251333333;7.4551193
85.74697405;-2.54376455
86.0050969666667;-10.6920746
86.5052030833333;-16.7077139833333
87.0041425833333;-21.5251990333333
87.5008796;-17.37159055
86.6042999666667;-11.1007427666667
83.8515028;-9.53614278333333
83.15485885;-9.60416698333333
