﻿lat;lon
70.5495;-122.905
70.5395;-122.9452
71.7748;-131.886
72.3453;-133.9958
72.8993;-135.9672
73.499;-134.2538
73.4997;-130.9033
74.5;-135.3113
74.5025;-135.3093
75.0168;-140.0768
75.9883;-140.0072
76.2273;-132.7022
76.5443;-135.3708
77.0063;-140.0402
78.001;-140.0163
79.1725;-140.2597
79.7013;-139.8178
79.6915;-139.7523
78.9975;-149.2898
78.3062;-153.2122
78.0047;-149.946
78.0108;-149.9892
77.491;-145.026
77.0043;-149.9142
75.999;-150.006
75.0052;-150.0805
75.2995;-153.3045
75.0095;-150.0518
71.3607;-152.0813
71.3945;-151.9447
71.4655;-151.8243
71.5207;-151.5898
71.5962;-151.3602
71.682;-151.1342
71.8172;-150.7568
71.9542;-150.3002
72.5003;-150.0053
73.0007;-150.0015
73.9983;-150.0382
72.5997;-144.6827
73.9847;-139.9057
73.9712;-139.8077
74.2947;-143.281
73.0093;-139.9148
72.0007;-140.0003
71.0103;-139.9893
72.0258;-132.8333
72.6208;-134.9908
73.236;-135.1263
73.471;-132.8959
73.8593;-132.5007
74.2119;-133.9272
75.5296;-139.5507
76.1657;-136.5506
76.7407;-137.4731
77.4623;-140.3501
78.4305;-139.9824
78.9888;-140.1701
79.1549;-143.3819
79.1544;-143.3791
79.1103;-146.5522
79.0961;-146.602
78.484;-149.2212
78.4735;-149.2542
78.164;-151.5908
78.095;-150.7039
77.7834;-147.4068
77.2375;-147.6027
76.5243;-150.0182
75.4946;-150.0073
75.2074;-152.3251
74.5573;-150.9569
74.0696;-151.8464
73.6726;-152.5035
73.2128;-153.3815
72.791;-154.1093
72.336;-154.8938
72.2202;-150.1461
72.7469;-150.0011
73.5319;-150.0057
72.2586;-148.0607
72.4344;-146.023
73.0722;-143.1454
73.4702;-141.6541
74.1663;-141.7132
74.1661;-141.7078
73.5091;-140.0603
72.5052;-139.986
71.5804;-139.9774
70.7454;-139.9702
70.5096;-139.9847
70.7197;-137.9171
70.5433;-122.9317
71.7733;-131.9017
72.347;-133.9917
72.9017;-135.9683
73.5;-134.25
73.4983;-130.9067
74.5017;-135.31
75.0167;-140.075
75.99;-140.0083
76.2267;-132.7067
77.9967;-140.0183
79.17;-140.2617
78.31;-153.2083
78.0117;-149.9853
77.4917;-145.03
77.0033;-149.9133
75.9962;-149.9937
75.0017;-150.075
75.2996;-153.2984
71.3617;-152.0817
71.3933;-151.945
71.5217;-151.5883
71.6817;-151.135
71.955;-150.305
72.5017;-150.0267
73;-150.0033
73.9983;-150.04
73.6017;-144.6783
74.292;-143.2853
73.0017;-139.8833
71.9998;-139.985
71.0083;-139.9833
74.98995;-149.9603
78.01835;-150.04265
74.0002833333333;-140.047333333333
