lat;lon
71.598789;-161.50623
72.22;-159.21
72.377636;-158.918845
72.479618;-158.885303
72.538305;-158.746905
72.608948;-158.632231
72.704816;-158.618
72.7478;-158.47062
72.82018;-158.30122
73.05;-158.06
77;-158
78;-157
78;-153.5
78;-150
79;-150
79.4735;-150
80.8379;-150
81.9683;-149.983358
82.7859;-149.9894
83.3117;-149.8978
85.8991;-147.5839
89.988215;-150
87.953292;179.291855
87.085163;-179.443158
85.117144;170.837883
84.013853;177.823268
83.163768;177.075699
82.039679;178.956547
80.808611;179.80987
79.493117;-178.61472
78.426294;-177.82171
77.073985;-175.82064
75.006226;-167.96496
73.833136;-162.03988
73.763325;-162.234165
73.688565;-162.38239
73.650583;-162.47408
73.545075;-162.69189
73.483745;-162.82973
73.399311;-163.03492
73.343363;-162.6159
73.306231;-162.32532
73.274867;-162.04847
73.225271;-161.73157
73.141554;-161.72706
73.065386;-161.73719
72.984296;-161.73243
72.886725;-161.74419
72.690517;-161.72923
72.821136;-158.30675
67.675431;-168.95323
