﻿lat;lon
67.3175333333333;53.9577166666667;;;;;;
67.1895;55.3126;;;;;;
67.1518666666667;55.8173833333333;;;;;;
67.1004666666667;56.30295;;;;;;
67.0668333333333;56.6852;;;;;;
67.0359166666667;57.04115;;;;;;
67.0139166666667;57.3528166666667;;;;;;
66.9774333333333;57.68685;;;;;;
69.1643833333333;54.3321166666667;;;;;;
69.0925666666667;54.8916;;;;;;
69.00465;55.5888166666667;;;;;;
68.9180666666667;56.2760333333333;;;;;;
68.83415;56.9853833333333;;;;;;
68.7440333333333;57.701;;;;;;
68.6561166666667;58.3915833333333;;;;;;
68.5687333333333;59.0948;;;;;;
72.7502833333333;64.8543833333333;;;;;;
68.5379333333333;59.3319333333333;;;;;;
68.5265;59.4627833333333;;;;;;
68.4871666666667;59.6905333333333;;;;;;
68.4687;59.9175166666667;;;;;;
68.43825;60.15665;;;;;;
68.39375;60.4858666666667;;;;;;
68.3071333333333;61.1991666666667;;;;;;
68.1823;61.48745;;;;;;
68.04845;61.7720666666667;;;;;;
67.9173166666667;62.0587666666667;;;;;;
67.8441166666667;62.2244833333333;;;;;;
67.7702166666667;62.3602833333333;;;;;;
67.67385;62.61595;;;;;;
67.6279666666667;62.7511;;;;;;
67.5571833333333;62.92485;;;;;;
67.2570166666667;54.49455;;;;;;
67.22795;54.8654333333333;;;;;;
66.69455;60.7683666666667;;;;;;
66.7328166666667;60.4806333333333;;;;;;
66.934;58.3851;;;;;;
66.8444166666667;59.0616333333333;;;;;;
66.819;59.6253833333333;;;;;;
66.7600833333333;60.067;;;;;;
64.1998666666667;63.19805;;;;;;
63.9584666666667;62.5600333333333;;;;;;
63.7212166666667;61.9217166666667;;;;;;
63.47935;61.2798166666667;;;;;;
63.23835;60.6356;;;;;;
63.1184166666667;60.3226333333333;;;;;;
62.9984166666667;60.00185;;;;;;
62.7146333333333;59.24275;;;;;;
