﻿lat;lon
65.17352;-168.69076
65.90172;-168.4217
66.62993;-168.68722
67.1499;-168.82338
67.67004;-168.9601
67.78296;-168.6018
67.89801;-168.2347
68.01301;-167.86712
68.12803;-167.49474
68.24194;-167.12176
68.41841;-168.81297
69.16664;-168.6663
69.83333;-168.66612
70.49991;-168.66684
70.96484;-168.66667
71.43003;-168.6667
71.89502;-168.66662
72.3601;-168.666
72.82491;-168.66687
73.88862;-168.2007
74.34465;-168.0494
74.80061;-167.89852
76.00344;-170.5867
77.00083;-170.04708
77.69989;-169.50086
77.00994;-175.03444
76.00656;-175.52622
75.99265;179.95376
76.18552;178.046
76.59263;179.02172
77.00161;180
77.49556;-177.49116
78.00011;-175.1381
78.04525;179.88754
79.99972;172.40422
79.50268;172.47572
78.99831;172.66222
78.49627;173.01824
77.98741;173.28462
77.50127;173.42946
77.00517;173.57964
76.49984;173.59992
76.04267;173.5707
75.50013;173.59988
75.04455;175.2113
74.63624;174.91637
74.49993;173.59968
73.45993;168.70076
74.00002;169.99978
74.33335;171.19994
74.66644;172.39993
74.99995;173.60004
75.26679;174.75202
75.53362;175.90378
75.80054;177.05676
75.07494;176.80066
75.11252;178.39936
75.15002;189.96301
75.14995;-178.00014
75.15003;-176
75.19542;-173.98754
75.24438;-171.97415
75.02432;-169.95598
74.80064;-167.8979
75.24656;-167.262
75.69125;-166.63742
76.13433;-165.48412
76.56653;-164.332
77.02504;-164.22504
77.47223;-164.118
77.96314;-163.8934
78.45384;-163.66866
78.37246;-171.49964
78.75001;-168.00158
79.12495;-164.50082
78.97617;-162.34254
79.49988;-160.9957
78.50021;-157.99954
77.50002;-158.87502
76.34201;-156.3159
76.49773;-159.9936
75.50342;-161.12244
73.96392;-160.08286
73.5437;-159.95476
73.36826;-160.24512
74.49895;-162.26198
74.61523;-163.91786
74.70785;-165.90714
