CMakeLists.txt 80a064bd96ae1bcac2562de38b91eead84a50cb30fd4bdaa7caae97285c28504
cmake 3.27.1
features core
portfile.cmake 09cae7f448085b03cacc978501a6c884fe4b3d68f7be299f0d4940619d03a39f
ports.cmake 5a8e00cedff0c898b1f90f7d129329d0288801bc9056562b039698caf31ff3f3
post_build_checks 2
triplet x64-linux
triplet_abi 3600011444071beb27b81ff82b3c866e3d4054636e3011609deb313d2baf57fd-b3b2cd43408edc7b2c5525859d9730edbfba2e4068956c6607a21d0abdaef072-7859d895726bbf4d114e741f0355383c61bc8fd4
usage 5c0f347a3edf9bb6190aa4efdeb1901b383a74fd7c3423c1041ba7eb19a90ae3
vcpkg-cmake 9b1c2341d7a8b2bf8b3fc6e44f70240b1c4a24a50ffc5fa1df7d976d923486a0
vcpkg-cmake-config 9cdd380a2c187864c91064f5fc33fc4bb0547104c5ec43d006f173be5f7fa282
vcpkg.json d5579fe3207c7f169e6613e49e2a0536e423d260957b25b41d22502688a4f625
vcpkg_from_git 8f27bff0d01c6d15a3e691758df52bfbb0b1b929da45c4ebba02ef76b54b1881
vcpkg_from_github b743742296a114ea1b18ae99672e02f142c4eb2bef7f57d36c038bedbfb0502f
vcpkg_install_copyright ba6c169ab4e59fa05682e530cdeb883767de22c8391f023d4e6844a7ec5dd3d2
