@startuml
hide empty description
state UpdateSchedule {
    StartUpdate : update initiating renderer
    DirectUpdate : update flagged renderer
    EventPause : process other user events

    [*] --> Idle
    Idle -> StartUpdate : new redraw
    StartUpdate -> DirectUpdate
    DirectUpdate -> DirectUpdate : time < 200ms
    DirectUpdate ---> EventPause : time ≥ 200ms
    EventPause ---> DirectUpdate : continue to redraw after all events cleared
    EventPause -> StartUpdate : new redraw
    DirectUpdate --> Idle : finished updating
}
@enduml