{
  "name": "_Example",
  "colonies": [
    {
      "CENTER": {
        "x": 372,
        "y": 396
      },
      "size": 50,
      "color": "cyan"
    },
    {
      "CENTER": {
        "x": 652,
        "y": 254
      },
      "size": 25,
      "color": "red"
    }
  ],
  "foodCaches": [
    {
      "CENTER": {
        "x": 617,
        "y": 159
      },
      "foodAmount": 25
    },
    {
      "CENTER": {
        "x": 633,
        "y": 364
      },
      "foodAmount": 25
    },
    {
      "CENTER": {
        "x": 600,
        "y": 582
      },
      "foodAmount": 25
    },
    {
      "CENTER": {
        "x": 339,
        "y": 616
      },
      "foodAmount": 25
    },
    {
      "CENTER": {
        "x": 102,
        "y": 406
      },
      "foodAmount": 25
    },
    {
      "CENTER": {
        "x": 202,
        "y": 171
      },
      "foodAmount": 25
    },
    {
      "CENTER": {
        "x": 397,
        "y": 150
      },
      "foodAmount": 25
    }
  ],
  "walls": [
    {
      "CENTER": {
        "x": 14,
        "y": 371
      },
      "size": 25
    },
    {
      "CENTER": {
        "x": 14,
        "y": 359
      },
      "size": 25
    },
    {
      "CENTER": {
        "x": 16,
        "y": 347
      },
      "size": 25
    },
    {
      "CENTER": {
        "x": 19,
        "y": 334
      },
      "size": 25
    },
    {
      "CENTER": {
        "x": 25,
        "y": 322
      },
      "size": 25
    },
    {
      "CENTER": {
        "x": 30,
        "y": 311
      },
      "size": 25
    },
    {
      "CENTER": {
        "x": 36,
        "y": 299
      },
      "size": 25
    },
    {
      "CENTER": {
        "x": 41,
        "y": 287
      },
      "size": 25
    },
    {
      "CENTER": {
        "x": 46,
        "y": 276
      },
      "size": 25
    },
    {
      "CENTER": {
        "x": 51,
        "y": 264
      },
      "size": 25
    },
    {
      "CENTER": {
        "x": 56,
        "y": 251
      },
      "size": 25
    },
    {
      "CENTER": {
        "x": 62,
        "y": 239
      },
      "size": 25
    },
    {
      "CENTER": {
        "x": 70,
        "y": 226
      },
      "size": 25
    },
    {
      "CENTER": {
        "x": 78,
        "y": 214
      },
      "size": 25
    },
    {
      "CENTER": {
        "x": 86,
        "y": 204
      },
      "size": 25
    },
    {
      "CENTER": {
        "x": 94,
        "y": 193
      },
      "size": 25
    },
    {
      "CENTER": {
        "x": 104,
        "y": 181
      },
      "size": 25
    },
    {
      "CENTER": {
        "x": 113,
        "y": 168
      },
      "size": 25
    },
    {
      "CENTER": {
        "x": 124,
        "y": 158
      },
      "size": 25
    },
    {
      "CENTER": {
        "x": 134,
        "y": 148
      },
      "size": 25
    },
    {
      "CENTER": {
        "x": 148,
        "y": 141
      },
      "size": 25
    },
    {
      "CENTER": {
        "x": 160,
        "y": 133
      },
      "size": 25
    },
    {
      "CENTER": {
        "x": 177,
        "y": 125
      },
      "size": 25
    },
    {
      "CENTER": {
        "x": 188,
        "y": 117
      },
      "size": 25
    },
    {
      "CENTER": {
        "x": 200,
        "y": 114
      },
      "size": 25
    },
    {
      "CENTER": {
        "x": 222,
        "y": 102
      },
      "size": 25
    },
    {
      "CENTER": {
        "x": 233,
        "y": 96
      },
      "size": 25
    },
    {
      "CENTER": {
        "x": 251,
        "y": 88
      },
      "size": 25
    },
    {
      "CENTER": {
        "x": 268,
        "y": 85
      },
      "size": 25
    },
    {
      "CENTER": {
        "x": 286,
        "y": 81
      },
      "size": 25
    },
    {
      "CENTER": {
        "x": 304,
        "y": 79
      },
      "size": 25
    },
    {
      "CENTER": {
        "x": 321,
        "y": 79
      },
      "size": 25
    },
    {
      "CENTER": {
        "x": 342,
        "y": 79
      },
      "size": 25
    },
    {
      "CENTER": {
        "x": 366,
        "y": 77
      },
      "size": 25
    },
    {
      "CENTER": {
        "x": 379,
        "y": 77
      },
      "size": 25
    },
    {
      "CENTER": {
        "x": 393,
        "y": 77
      },
      "size": 25
    },
    {
      "CENTER": {
        "x": 408,
        "y": 79
      },
      "size": 25
    },
    {
      "CENTER": {
        "x": 420,
        "y": 81
      },
      "size": 25
    },
    {
      "CENTER": {
        "x": 435,
        "y": 83
      },
      "size": 25
    },
    {
      "CENTER": {
        "x": 448,
        "y": 86
      },
      "size": 25
    },
    {
      "CENTER": {
        "x": 467,
        "y": 92
      },
      "size": 25
    },
    {
      "CENTER": {
        "x": 481,
        "y": 96
      },
      "size": 25
    },
    {
      "CENTER": {
        "x": 496,
        "y": 98
      },
      "size": 25
    },
    {
      "CENTER": {
        "x": 510,
        "y": 98
      },
      "size": 25
    },
    {
      "CENTER": {
        "x": 524,
        "y": 102
      },
      "size": 25
    },
    {
      "CENTER": {
        "x": 537,
        "y": 106
      },
      "size": 25
    },
    {
      "CENTER": {
        "x": 550,
        "y": 110
      },
      "size": 25
    },
    {
      "CENTER": {
        "x": 564,
        "y": 110
      },
      "size": 25
    },
    {
      "CENTER": {
        "x": 579,
        "y": 110
      },
      "size": 25
    },
    {
      "CENTER": {
        "x": 592,
        "y": 110
      },
      "size": 25
    },
    {
      "CENTER": {
        "x": 606,
        "y": 110
      },
      "size": 25
    },
    {
      "CENTER": {
        "x": 619,
        "y": 112
      },
      "size": 25
    },
    {
      "CENTER": {
        "x": 632,
        "y": 115
      },
      "size": 25
    },
    {
      "CENTER": {
        "x": 644,
        "y": 125
      },
      "size": 25
    },
    {
      "CENTER": {
        "x": 656,
        "y": 131
      },
      "size": 25
    },
    {
      "CENTER": {
        "x": 665,
        "y": 142
      },
      "size": 25
    },
    {
      "CENTER": {
        "x": 670,
        "y": 154
      },
      "size": 25
    },
    {
      "CENTER": {
        "x": 676,
        "y": 166
      },
      "size": 25
    },
    {
      "CENTER": {
        "x": 691,
        "y": 166
      },
      "size": 25
    },
    {
      "CENTER": {
        "x": 705,
        "y": 170
      },
      "size": 25
    },
    {
      "CENTER": {
        "x": 720,
        "y": 175
      },
      "size": 25
    },
    {
      "CENTER": {
        "x": 731,
        "y": 181
      },
      "size": 25
    },
    {
      "CENTER": {
        "x": 740,
        "y": 189
      },
      "size": 25
    },
    {
      "CENTER": {
        "x": 753,
        "y": 199
      },
      "size": 25
    },
    {
      "CENTER": {
        "x": 763,
        "y": 208
      },
      "size": 25
    },
    {
      "CENTER": {
        "x": 774,
        "y": 214
      },
      "size": 25
    },
    {
      "CENTER": {
        "x": 784,
        "y": 222
      },
      "size": 25
    },
    {
      "CENTER": {
        "x": 795,
        "y": 229
      },
      "size": 25
    },
    {
      "CENTER": {
        "x": 11,
        "y": 587
      },
      "size": 15
    },
    {
      "CENTER": {
        "x": 38,
        "y": 589
      },
      "size": 15
    },
    {
      "CENTER": {
        "x": 48,
        "y": 593
      },
      "size": 15
    },
    {
      "CENTER": {
        "x": 81,
        "y": 602
      },
      "size": 15
    },
    {
      "CENTER": {
        "x": 131,
        "y": 622
      },
      "size": 15
    },
    {
      "CENTER": {
        "x": 174,
        "y": 641
      },
      "size": 15
    },
    {
      "CENTER": {
        "x": 206,
        "y": 653
      },
      "size": 15
    },
    {
      "CENTER": {
        "x": 235,
        "y": 664
      },
      "size": 15
    },
    {
      "CENTER": {
        "x": 259,
        "y": 672
      },
      "size": 15
    },
    {
      "CENTER": {
        "x": 276,
        "y": 678
      },
      "size": 15
    },
    {
      "CENTER": {
        "x": 289,
        "y": 684
      },
      "size": 15
    },
    {
      "CENTER": {
        "x": 300,
        "y": 687
      },
      "size": 15
    },
    {
      "CENTER": {
        "x": 310,
        "y": 691
      },
      "size": 15
    },
    {
      "CENTER": {
        "x": 323,
        "y": 695
      },
      "size": 15
    },
    {
      "CENTER": {
        "x": 332,
        "y": 699
      },
      "size": 15
    },
    {
      "CENTER": {
        "x": 347,
        "y": 705
      },
      "size": 15
    },
    {
      "CENTER": {
        "x": 358,
        "y": 711
      },
      "size": 15
    },
    {
      "CENTER": {
        "x": 374,
        "y": 718
      },
      "size": 15
    },
    {
      "CENTER": {
        "x": 393,
        "y": 722
      },
      "size": 15
    },
    {
      "CENTER": {
        "x": 403,
        "y": 724
      },
      "size": 15
    },
    {
      "CENTER": {
        "x": 411,
        "y": 724
      },
      "size": 15
    },
    {
      "CENTER": {
        "x": 422,
        "y": 726
      },
      "size": 15
    },
    {
      "CENTER": {
        "x": 412,
        "y": 724
      },
      "size": 15
    },
    {
      "CENTER": {
        "x": 400,
        "y": 720
      },
      "size": 15
    },
    {
      "CENTER": {
        "x": 374,
        "y": 714
      },
      "size": 15
    },
    {
      "CENTER": {
        "x": 356,
        "y": 711
      },
      "size": 15
    },
    {
      "CENTER": {
        "x": 347,
        "y": 707
      },
      "size": 15
    },
    {
      "CENTER": {
        "x": 332,
        "y": 705
      },
      "size": 15
    },
    {
      "CENTER": {
        "x": 321,
        "y": 703
      },
      "size": 15
    },
    {
      "CENTER": {
        "x": 312,
        "y": 699
      },
      "size": 15
    },
    {
      "CENTER": {
        "x": 299,
        "y": 697
      },
      "size": 15
    },
    {
      "CENTER": {
        "x": 288,
        "y": 695
      },
      "size": 15
    },
    {
      "CENTER": {
        "x": 275,
        "y": 693
      },
      "size": 15
    },
    {
      "CENTER": {
        "x": 262,
        "y": 691
      },
      "size": 15
    },
    {
      "CENTER": {
        "x": 249,
        "y": 687
      },
      "size": 15
    },
    {
      "CENTER": {
        "x": 235,
        "y": 684
      },
      "size": 15
    },
    {
      "CENTER": {
        "x": 225,
        "y": 680
      },
      "size": 15
    },
    {
      "CENTER": {
        "x": 214,
        "y": 676
      },
      "size": 15
    },
    {
      "CENTER": {
        "x": 208,
        "y": 670
      },
      "size": 15
    },
    {
      "CENTER": {
        "x": 200,
        "y": 666
      },
      "size": 15
    },
    {
      "CENTER": {
        "x": 193,
        "y": 662
      },
      "size": 15
    },
    {
      "CENTER": {
        "x": 187,
        "y": 657
      },
      "size": 15
    },
    {
      "CENTER": {
        "x": 179,
        "y": 653
      },
      "size": 15
    },
    {
      "CENTER": {
        "x": 171,
        "y": 649
      },
      "size": 15
    },
    {
      "CENTER": {
        "x": 163,
        "y": 645
      },
      "size": 15
    },
    {
      "CENTER": {
        "x": 156,
        "y": 643
      },
      "size": 15
    },
    {
      "CENTER": {
        "x": 145,
        "y": 641
      },
      "size": 15
    },
    {
      "CENTER": {
        "x": 137,
        "y": 637
      },
      "size": 15
    },
    {
      "CENTER": {
        "x": 128,
        "y": 633
      },
      "size": 15
    },
    {
      "CENTER": {
        "x": 121,
        "y": 629
      },
      "size": 15
    },
    {
      "CENTER": {
        "x": 113,
        "y": 626
      },
      "size": 15
    },
    {
      "CENTER": {
        "x": 105,
        "y": 620
      },
      "size": 15
    },
    {
      "CENTER": {
        "x": 97,
        "y": 616
      },
      "size": 15
    },
    {
      "CENTER": {
        "x": 91,
        "y": 612
      },
      "size": 15
    },
    {
      "CENTER": {
        "x": 84,
        "y": 608
      },
      "size": 15
    },
    {
      "CENTER": {
        "x": 72,
        "y": 604
      },
      "size": 15
    },
    {
      "CENTER": {
        "x": 65,
        "y": 602
      },
      "size": 15
    },
    {
      "CENTER": {
        "x": 57,
        "y": 602
      },
      "size": 15
    },
    {
      "CENTER": {
        "x": 48,
        "y": 600
      },
      "size": 15
    },
    {
      "CENTER": {
        "x": 40,
        "y": 599
      },
      "size": 15
    },
    {
      "CENTER": {
        "x": 32,
        "y": 597
      },
      "size": 15
    },
    {
      "CENTER": {
        "x": 24,
        "y": 597
      },
      "size": 15
    },
    {
      "CENTER": {
        "x": 17,
        "y": 597
      },
      "size": 15
    },
    {
      "CENTER": {
        "x": 35,
        "y": 602
      },
      "size": 15
    },
    {
      "CENTER": {
        "x": 57,
        "y": 606
      },
      "size": 15
    },
    {
      "CENTER": {
        "x": 83,
        "y": 612
      },
      "size": 15
    },
    {
      "CENTER": {
        "x": 120,
        "y": 618
      },
      "size": 15
    },
    {
      "CENTER": {
        "x": 131,
        "y": 620
      },
      "size": 15
    },
    {
      "CENTER": {
        "x": 150,
        "y": 622
      },
      "size": 15
    },
    {
      "CENTER": {
        "x": 168,
        "y": 626
      },
      "size": 15
    },
    {
      "CENTER": {
        "x": 182,
        "y": 629
      },
      "size": 15
    },
    {
      "CENTER": {
        "x": 196,
        "y": 633
      },
      "size": 15
    },
    {
      "CENTER": {
        "x": 206,
        "y": 639
      },
      "size": 15
    },
    {
      "CENTER": {
        "x": 214,
        "y": 643
      },
      "size": 15
    },
    {
      "CENTER": {
        "x": 220,
        "y": 647
      },
      "size": 15
    },
    {
      "CENTER": {
        "x": 228,
        "y": 653
      },
      "size": 15
    },
    {
      "CENTER": {
        "x": 235,
        "y": 657
      },
      "size": 15
    },
    {
      "CENTER": {
        "x": 243,
        "y": 664
      },
      "size": 15
    },
    {
      "CENTER": {
        "x": 249,
        "y": 670
      },
      "size": 15
    },
    {
      "CENTER": {
        "x": 259,
        "y": 678
      },
      "size": 15
    },
    {
      "CENTER": {
        "x": 273,
        "y": 691
      },
      "size": 15
    },
    {
      "CENTER": {
        "x": 284,
        "y": 701
      },
      "size": 15
    },
    {
      "CENTER": {
        "x": 291,
        "y": 705
      },
      "size": 15
    },
    {
      "CENTER": {
        "x": 297,
        "y": 711
      },
      "size": 15
    },
    {
      "CENTER": {
        "x": 304,
        "y": 718
      },
      "size": 15
    },
    {
      "CENTER": {
        "x": 313,
        "y": 726
      },
      "size": 15
    },
    {
      "CENTER": {
        "x": 323,
        "y": 732
      },
      "size": 15
    },
    {
      "CENTER": {
        "x": 337,
        "y": 738
      },
      "size": 15
    },
    {
      "CENTER": {
        "x": 352,
        "y": 742
      },
      "size": 15
    },
    {
      "CENTER": {
        "x": 366,
        "y": 745
      },
      "size": 15
    },
    {
      "CENTER": {
        "x": 379,
        "y": 747
      },
      "size": 15
    },
    {
      "CENTER": {
        "x": 390,
        "y": 749
      },
      "size": 15
    },
    {
      "CENTER": {
        "x": 401,
        "y": 749
      },
      "size": 15
    },
    {
      "CENTER": {
        "x": 412,
        "y": 751
      },
      "size": 15
    },
    {
      "CENTER": {
        "x": 422,
        "y": 751
      },
      "size": 15
    },
    {
      "CENTER": {
        "x": 430,
        "y": 751
      },
      "size": 15
    },
    {
      "CENTER": {
        "x": 438,
        "y": 751
      },
      "size": 15
    },
    {
      "CENTER": {
        "x": 448,
        "y": 751
      },
      "size": 15
    },
    {
      "CENTER": {
        "x": 457,
        "y": 749
      },
      "size": 15
    },
    {
      "CENTER": {
        "x": 464,
        "y": 749
      },
      "size": 15
    },
    {
      "CENTER": {
        "x": 451,
        "y": 745
      },
      "size": 15
    },
    {
      "CENTER": {
        "x": 433,
        "y": 740
      },
      "size": 15
    },
    {
      "CENTER": {
        "x": 411,
        "y": 734
      },
      "size": 15
    },
    {
      "CENTER": {
        "x": 387,
        "y": 724
      },
      "size": 15
    },
    {
      "CENTER": {
        "x": 369,
        "y": 716
      },
      "size": 15
    },
    {
      "CENTER": {
        "x": 353,
        "y": 709
      },
      "size": 15
    },
    {
      "CENTER": {
        "x": 344,
        "y": 705
      },
      "size": 15
    },
    {
      "CENTER": {
        "x": 334,
        "y": 701
      },
      "size": 15
    },
    {
      "CENTER": {
        "x": 326,
        "y": 699
      },
      "size": 15
    },
    {
      "CENTER": {
        "x": 334,
        "y": 701
      },
      "size": 15
    },
    {
      "CENTER": {
        "x": 350,
        "y": 705
      },
      "size": 15
    },
    {
      "CENTER": {
        "x": 363,
        "y": 711
      },
      "size": 15
    },
    {
      "CENTER": {
        "x": 380,
        "y": 718
      },
      "size": 15
    },
    {
      "CENTER": {
        "x": 400,
        "y": 726
      },
      "size": 15
    },
    {
      "CENTER": {
        "x": 416,
        "y": 734
      },
      "size": 15
    },
    {
      "CENTER": {
        "x": 427,
        "y": 742
      },
      "size": 15
    },
    {
      "CENTER": {
        "x": 454,
        "y": 756
      },
      "size": 15
    },
    {
      "CENTER": {
        "x": 466,
        "y": 756
      },
      "size": 15
    },
    {
      "CENTER": {
        "x": 477,
        "y": 756
      },
      "size": 15
    },
    {
      "CENTER": {
        "x": 486,
        "y": 756
      },
      "size": 15
    },
    {
      "CENTER": {
        "x": 495,
        "y": 756
      },
      "size": 15
    },
    {
      "CENTER": {
        "x": 507,
        "y": 755
      },
      "size": 15
    },
    {
      "CENTER": {
        "x": 515,
        "y": 753
      },
      "size": 15
    },
    {
      "CENTER": {
        "x": 522,
        "y": 750
      },
      "size": 15
    },
    {
      "CENTER": {
        "x": 527,
        "y": 745
      },
      "size": 15
    },
    {
      "CENTER": {
        "x": 534,
        "y": 741
      },
      "size": 15
    },
    {
      "CENTER": {
        "x": 542,
        "y": 737
      },
      "size": 15
    },
    {
      "CENTER": {
        "x": 549,
        "y": 733
      },
      "size": 15
    },
    {
      "CENTER": {
        "x": 557,
        "y": 730
      },
      "size": 15
    },
    {
      "CENTER": {
        "x": 570,
        "y": 721
      },
      "size": 15
    },
    {
      "CENTER": {
        "x": 582,
        "y": 712
      },
      "size": 15
    },
    {
      "CENTER": {
        "x": 590,
        "y": 705
      },
      "size": 15
    },
    {
      "CENTER": {
        "x": 595,
        "y": 700
      },
      "size": 15
    },
    {
      "CENTER": {
        "x": 600,
        "y": 694
      },
      "size": 15
    },
    {
      "CENTER": {
        "x": 605,
        "y": 689
      },
      "size": 15
    },
    {
      "CENTER": {
        "x": 614,
        "y": 681
      },
      "size": 15
    },
    {
      "CENTER": {
        "x": 623,
        "y": 673
      },
      "size": 15
    },
    {
      "CENTER": {
        "x": 629,
        "y": 668
      },
      "size": 15
    },
    {
      "CENTER": {
        "x": 638,
        "y": 661
      },
      "size": 15
    },
    {
      "CENTER": {
        "x": 645,
        "y": 655
      },
      "size": 15
    },
    {
      "CENTER": {
        "x": 651,
        "y": 650
      },
      "size": 15
    },
    {
      "CENTER": {
        "x": 657,
        "y": 643
      },
      "size": 15
    },
    {
      "CENTER": {
        "x": 667,
        "y": 636
      },
      "size": 15
    },
    {
      "CENTER": {
        "x": 675,
        "y": 629
      },
      "size": 15
    },
    {
      "CENTER": {
        "x": 680,
        "y": 623
      },
      "size": 15
    },
    {
      "CENTER": {
        "x": 685,
        "y": 618
      },
      "size": 15
    },
    {
      "CENTER": {
        "x": 691,
        "y": 613
      },
      "size": 15
    },
    {
      "CENTER": {
        "x": 698,
        "y": 605
      },
      "size": 15
    },
    {
      "CENTER": {
        "x": 704,
        "y": 598
      },
      "size": 15
    },
    {
      "CENTER": {
        "x": 709,
        "y": 592
      },
      "size": 15
    },
    {
      "CENTER": {
        "x": 714,
        "y": 586
      },
      "size": 15
    },
    {
      "CENTER": {
        "x": 720,
        "y": 581
      },
      "size": 15
    },
    {
      "CENTER": {
        "x": 727,
        "y": 573
      },
      "size": 15
    },
    {
      "CENTER": {
        "x": 733,
        "y": 569
      },
      "size": 15
    },
    {
      "CENTER": {
        "x": 738,
        "y": 564
      },
      "size": 15
    },
    {
      "CENTER": {
        "x": 743,
        "y": 558
      },
      "size": 15
    },
    {
      "CENTER": {
        "x": 749,
        "y": 553
      },
      "size": 15
    },
    {
      "CENTER": {
        "x": 756,
        "y": 545
      },
      "size": 15
    },
    {
      "CENTER": {
        "x": 763,
        "y": 539
      },
      "size": 15
    },
    {
      "CENTER": {
        "x": 771,
        "y": 535
      },
      "size": 15
    },
    {
      "CENTER": {
        "x": 779,
        "y": 531
      },
      "size": 15
    },
    {
      "CENTER": {
        "x": 786,
        "y": 526
      },
      "size": 15
    },
    {
      "CENTER": {
        "x": 792,
        "y": 519
      },
      "size": 15
    },
    {
      "CENTER": {
        "x": 794,
        "y": 512
      },
      "size": 15
    },
    {
      "CENTER": {
        "x": 574,
        "y": 712
      },
      "size": 15
    },
    {
      "CENTER": {
        "x": 567,
        "y": 717
      },
      "size": 15
    },
    {
      "CENTER": {
        "x": 561,
        "y": 722
      },
      "size": 15
    },
    {
      "CENTER": {
        "x": 556,
        "y": 728
      },
      "size": 15
    },
    {
      "CENTER": {
        "x": 550,
        "y": 733
      },
      "size": 15
    },
    {
      "CENTER": {
        "x": 545,
        "y": 738
      },
      "size": 15
    },
    {
      "CENTER": {
        "x": 553,
        "y": 731
      },
      "size": 15
    },
    {
      "CENTER": {
        "x": 562,
        "y": 725
      },
      "size": 15
    },
    {
      "CENTER": {
        "x": 570,
        "y": 719
      },
      "size": 15
    },
    {
      "CENTER": {
        "x": 582,
        "y": 712
      },
      "size": 15
    },
    {
      "CENTER": {
        "x": 591,
        "y": 706
      },
      "size": 15
    },
    {
      "CENTER": {
        "x": 602,
        "y": 698
      },
      "size": 15
    },
    {
      "CENTER": {
        "x": 608,
        "y": 694
      },
      "size": 15
    },
    {
      "CENTER": {
        "x": 614,
        "y": 688
      },
      "size": 15
    },
    {
      "CENTER": {
        "x": 619,
        "y": 681
      },
      "size": 15
    },
    {
      "CENTER": {
        "x": 624,
        "y": 676
      },
      "size": 15
    },
    {
      "CENTER": {
        "x": 792,
        "y": 237
      },
      "size": 15
    },
    {
      "CENTER": {
        "x": 792,
        "y": 245
      },
      "size": 15
    },
    {
      "CENTER": {
        "x": 792,
        "y": 257
      },
      "size": 15
    },
    {
      "CENTER": {
        "x": 792,
        "y": 264
      },
      "size": 15
    },
    {
      "CENTER": {
        "x": 791,
        "y": 271
      },
      "size": 15
    },
    {
      "CENTER": {
        "x": 790,
        "y": 278
      },
      "size": 15
    },
    {
      "CENTER": {
        "x": 790,
        "y": 286
      },
      "size": 15
    },
    {
      "CENTER": {
        "x": 790,
        "y": 294
      },
      "size": 15
    },
    {
      "CENTER": {
        "x": 790,
        "y": 301
      },
      "size": 15
    },
    {
      "CENTER": {
        "x": 790,
        "y": 311
      },
      "size": 15
    },
    {
      "CENTER": {
        "x": 789,
        "y": 319
      },
      "size": 15
    },
    {
      "CENTER": {
        "x": 789,
        "y": 326
      },
      "size": 15
    },
    {
      "CENTER": {
        "x": 788,
        "y": 334
      },
      "size": 15
    },
    {
      "CENTER": {
        "x": 787,
        "y": 341
      },
      "size": 15
    },
    {
      "CENTER": {
        "x": 787,
        "y": 350
      },
      "size": 15
    },
    {
      "CENTER": {
        "x": 787,
        "y": 358
      },
      "size": 15
    },
    {
      "CENTER": {
        "x": 786,
        "y": 366
      },
      "size": 15
    },
    {
      "CENTER": {
        "x": 785,
        "y": 378
      },
      "size": 15
    },
    {
      "CENTER": {
        "x": 785,
        "y": 388
      },
      "size": 15
    },
    {
      "CENTER": {
        "x": 785,
        "y": 397
      },
      "size": 15
    },
    {
      "CENTER": {
        "x": 785,
        "y": 409
      },
      "size": 15
    },
    {
      "CENTER": {
        "x": 785,
        "y": 419
      },
      "size": 15
    },
    {
      "CENTER": {
        "x": 785,
        "y": 427
      },
      "size": 15
    },
    {
      "CENTER": {
        "x": 785,
        "y": 437
      },
      "size": 15
    },
    {
      "CENTER": {
        "x": 785,
        "y": 451
      },
      "size": 15
    },
    {
      "CENTER": {
        "x": 785,
        "y": 461
      },
      "size": 15
    },
    {
      "CENTER": {
        "x": 785,
        "y": 469
      },
      "size": 15
    },
    {
      "CENTER": {
        "x": 785,
        "y": 481
      },
      "size": 15
    },
    {
      "CENTER": {
        "x": 785,
        "y": 490
      },
      "size": 15
    },
    {
      "CENTER": {
        "x": 785,
        "y": 498
      },
      "size": 15
    },
    {
      "CENTER": {
        "x": 785,
        "y": 505
      },
      "size": 15
    },
    {
      "CENTER": {
        "x": 785,
        "y": 513
      },
      "size": 15
    },
    {
      "CENTER": {
        "x": 8,
        "y": 596
      },
      "size": 15
    },
    {
      "CENTER": {
        "x": 8,
        "y": 589
      },
      "size": 15
    },
    {
      "CENTER": {
        "x": 8,
        "y": 579
      },
      "size": 15
    },
    {
      "CENTER": {
        "x": 8,
        "y": 570
      },
      "size": 15
    },
    {
      "CENTER": {
        "x": 8,
        "y": 562
      },
      "size": 15
    },
    {
      "CENTER": {
        "x": 9,
        "y": 553
      },
      "size": 15
    },
    {
      "CENTER": {
        "x": 9,
        "y": 545
      },
      "size": 15
    },
    {
      "CENTER": {
        "x": 9,
        "y": 538
      },
      "size": 15
    },
    {
      "CENTER": {
        "x": 9,
        "y": 531
      },
      "size": 15
    },
    {
      "CENTER": {
        "x": 9,
        "y": 523
      },
      "size": 15
    },
    {
      "CENTER": {
        "x": 9,
        "y": 513
      },
      "size": 15
    },
    {
      "CENTER": {
        "x": 9,
        "y": 502
      },
      "size": 15
    },
    {
      "CENTER": {
        "x": 9,
        "y": 495
      },
      "size": 15
    },
    {
      "CENTER": {
        "x": 9,
        "y": 488
      },
      "size": 15
    },
    {
      "CENTER": {
        "x": 9,
        "y": 479
      },
      "size": 15
    },
    {
      "CENTER": {
        "x": 8,
        "y": 470
      },
      "size": 15
    },
    {
      "CENTER": {
        "x": 8,
        "y": 459
      },
      "size": 15
    },
    {
      "CENTER": {
        "x": 8,
        "y": 446
      },
      "size": 15
    },
    {
      "CENTER": {
        "x": 8,
        "y": 439
      },
      "size": 15
    },
    {
      "CENTER": {
        "x": 8,
        "y": 432
      },
      "size": 15
    },
    {
      "CENTER": {
        "x": 8,
        "y": 423
      },
      "size": 15
    },
    {
      "CENTER": {
        "x": 8,
        "y": 415
      },
      "size": 15
    },
    {
      "CENTER": {
        "x": 8,
        "y": 407
      },
      "size": 15
    },
    {
      "CENTER": {
        "x": 7,
        "y": 397
      },
      "size": 15
    },
    {
      "CENTER": {
        "x": 7,
        "y": 390
      },
      "size": 15
    },
    {
      "CENTER": {
        "x": 7,
        "y": 383
      },
      "size": 15
    }
  ],
  "size": {
    "width": 800,
    "height": 800
  }
}