<?xml version="1.0" encoding="UTF-8" standalone="no"?>
<svg
   xmlns:dc="http://purl.org/dc/elements/1.1/"
   xmlns:cc="http://creativecommons.org/ns#"
   xmlns:rdf="http://www.w3.org/1999/02/22-rdf-syntax-ns#"
   xmlns:svg="http://www.w3.org/2000/svg"
   xmlns="http://www.w3.org/2000/svg"
   xmlns:xlink="http://www.w3.org/1999/xlink"
   xmlns:sodipodi="http://sodipodi.sourceforge.net/DTD/sodipodi-0.dtd"
   xmlns:inkscape="http://www.inkscape.org/namespaces/inkscape"
   width="32px"
   height="32px"
   viewBox="0 0 32 32"
   version="1.1"
   id="SVGRoot"
   sodipodi:docname="turnstile-icon-round.svg"
   inkscape:export-filename="/home/gylterud/Pictures/forall-large-round.png"
   inkscape:export-xdpi="767.09998"
   inkscape:export-ydpi="767.09998"
   inkscape:version="0.92.5 (2060ec1f9f, 2020-04-08)">
  <sodipodi:namedview
     pagecolor="#ffffff"
     bordercolor="#666666"
     borderopacity="1"
     objecttolerance="10"
     gridtolerance="10"
     guidetolerance="10"
     inkscape:pageopacity="0"
     inkscape:pageshadow="2"
     inkscape:window-width="1918"
     inkscape:window-height="1007"
     id="namedview917"
     showgrid="false"
     inkscape:zoom="3.6914062"
     inkscape:cx="62.838368"
     inkscape:cy="5.4304831"
     inkscape:window-x="0"
     inkscape:window-y="24"
     inkscape:window-maximized="0"
     inkscape:current-layer="layer1" />
  <defs
     id="defs3713">
    <linearGradient
       id="linearGradient6194">
      <stop
         style="stop-color:#e9e6af;stop-opacity:1"
         offset="0"
         id="stop6190" />
      <stop
         style="stop-color:#fcfcfc;stop-opacity:1"
         offset="1"
         id="stop6192" />
    </linearGradient>
    <linearGradient
       id="linearGradient4588-3-7">
      <stop
         style="stop-color:#43ace2;stop-opacity:1;"
         offset="0"
         id="stop4584" />
      <stop
         style="stop-color:#bde9ff;stop-opacity:1"
         offset="1"
         id="stop4586" />
    </linearGradient>
    <linearGradient
       xlink:href="#linearGradient4588-3-7"
       id="linearGradient4597"
       gradientUnits="userSpaceOnUse"
       x1="0"
       y1="15.25"
       x2="32"
       y2="32"
       gradientTransform="matrix(0.967,0,0,0.967,0.528,0.528)" />
    <linearGradient
       xlink:href="#linearGradient6194"
       id="linearGradient6196"
       x1="4.9846194"
       y1="15.784073"
       x2="25.712093"
       y2="27.784073"
       gradientUnits="userSpaceOnUse"
       gradientTransform="matrix(1.0489926,0,0,1.0489926,-1.2655575,0.25362263)" />
    <linearGradient
       inkscape:collect="always"
       xlink:href="#linearGradient6194"
       id="linearGradient985"
       x1="5.6898885"
       y1="6.4724126"
       x2="28.328424"
       y2="30.491783"
       gradientUnits="userSpaceOnUse"
       gradientTransform="translate(1.5436727,-0.03840017)" />
    <linearGradient
       inkscape:collect="always"
       xlink:href="#linearGradient6194"
       id="linearGradient1650"
       x1="5.6898885"
       y1="6.4724126"
       x2="28.328424"
       y2="30.491783"
       gradientUnits="userSpaceOnUse"
       gradientTransform="translate(0.54787935,0.10957587)" />
  </defs>
  <metadata
     id="metadata3716">
    <rdf:RDF>
      <cc:Work
         rdf:about="">
        <dc:format>image/svg+xml</dc:format>
        <dc:type
           rdf:resource="http://purl.org/dc/dcmitype/StillImage" />
        <dc:title></dc:title>
      </cc:Work>
    </rdf:RDF>
  </metadata>
  <g
     id="layer1">
    <path
       style="fill:url(#linearGradient4597);fill-opacity:1;stroke:#002d42;stroke-width:0.96700001;stroke-linecap:butt;stroke-linejoin:miter;stroke-miterlimit:4;stroke-dasharray:none;stroke-opacity:1"
       d="M 15.91691,0.528 H 16 16.08309 c 8.262776,0 15.38891,5.8950539 15.38891,15.259271 V 16 16.184677 C 31.472,24.303787 25.05598,31.472 16.21854,31.472 H 16 15.815323 C 8.0793228,31.472 0.528,24.481316 0.528,16.21854 V 16 15.78146 C 0.528,7.2313522 7.9414665,0.528 15.91691,0.528 Z"
       id="path4568"
       inkscape:connector-curvature="0"
       sodipodi:nodetypes="scsscsscsscss" />
    <text
       xml:space="preserve"
       style="font-style:normal;font-variant:normal;font-weight:normal;font-stretch:normal;font-size:40px;line-height:1.25;font-family:sans-serif;letter-spacing:0px;word-spacing:0px;fill:url(#linearGradient985);fill-opacity:1;stroke:#002d42;stroke-width:0.83905512;stroke-miterlimit:4;stroke-dasharray:none;stroke-opacity:1"
       x="4.2167964"
       y="26.537872"
       id="text977"><tspan
         sodipodi:role="line"
         id="tspan975"
         x="4.2167964"
         y="26.537872"
         style="font-style:normal;font-variant:normal;font-weight:bold;font-stretch:normal;font-size:29.33333397px;font-family:'Khmer OS';-inkscape-font-specification:'Khmer OS Bold';fill:url(#linearGradient985);fill-opacity:1;stroke-width:0.83905512;stroke-miterlimit:4;stroke-dasharray:none">⊢</tspan></text>
  </g>
</svg>
