#################################
#-------------------------------#
#-------------------------------#
#RRRS---------------------------#
#######--####-------------------#
#-----#--#----------------------#
#-----####----------------------#
#-------------------------------#
#-----------------G-------------#
#-----B---WQV-------------------#
####################------------#
#-------------------------------#
#-------------------------------#
#-----------------------V-------#
#----------------------#######--#
#-------------------------------#
#-------------------#-----------#
#----RR-##----------#---J-------#
#-D--RR-##---WQV----#---------WV#
#################################