logg 11.04.2024
vi blir enige om å jobbe i branches for å så bruke merge requests på 
fix enteties
de har samme funksjoner og at alle extender
skriv Tester (vent med å skrive tester på enteties)
vi bruker møtet på å planlegge hvordan vi vil gå videre, lager en sjekkliste på hva vi ønsker i det ferdige produktet. 
Farge tema på hvert forskjellige level, Sprites: fikser vi i viewet. 
Size er definert i view, vil det ha noe med collision å gjøre. at det kan stretches. 
To forskjellige kamera følger spiller?? 
Vi har laget ønske liste og fordelt oppgaver som vi skal utføre link til liste ligger i Discord


