\relax 
\bibstyle{biblatex}
\bibdata{paper2-blx,paper2}
\citation{biblatex-control}
\abx@aux@refcontext{nty/global//global/global}
\citation{DelaunayTriangulation1997}
\abx@aux@cite{0}{DelaunayTriangulation1997}
\abx@aux@segm{0}{0}{DelaunayTriangulation1997}
\citation{gomppernelson2012}
\abx@aux@cite{0}{gomppernelson2012}
\abx@aux@segm{0}{0}{gomppernelson2012}
\@writefile{toc}{\contentsline {section}{\numberline {1}Introduction}{1}{}\protected@file@percent }
\@writefile{toc}{\contentsline {section}{\numberline {2}Include a graph}{1}{}\protected@file@percent }
\@writefile{toc}{\contentsline {section}{\numberline {3}Biliography}{1}{}\protected@file@percent }
\@writefile{lof}{\contentsline {figure}{\numberline {1}{\ignorespaces default}}{1}{}\protected@file@percent }
\newlabel{default}{{1}{1}}
\abx@aux@read@bbl@mdfivesum{685E8127355C6F85B74EEF26311F0DAD}
\abx@aux@defaultrefcontext{0}{gomppernelson2012}{nty/global//global/global}
\abx@aux@defaultrefcontext{0}{DelaunayTriangulation1997}{nty/global//global/global}
\abx@aux@defaultlabelprefix{0}{gomppernelson2012}{}
\abx@aux@defaultlabelprefix{0}{DelaunayTriangulation1997}{}
\gdef \@abspage@last{1}
