\relax 
\@writefile{toc}{\contentsline {section}{\numberline {1}Workflow}{1}{}\protected@file@percent }
\@writefile{toc}{\contentsline {section}{\numberline {2}Make dependencies}{2}{}\protected@file@percent }
\@writefile{toc}{\contentsline {section}{\numberline {3}The Makefile contents}{3}{}\protected@file@percent }
\@writefile{lol}{\contentsline {lstlisting}{Makefile}{3}{}\protected@file@percent }
\@writefile{toc}{\contentsline {section}{\numberline {4}}{3}{}\protected@file@percent }
\gdef \@abspage@last{3}
